BDBM19986 (2R,6S,7R)-7-(4-hydroxyphenyl)-10-methyl-8-oxatricyclo[7.4.0.0^{2,6}]trideca-1(9),10,12-trien-12-ol::A-ring modified benzopyran scaffold, 2a
SMILES: Cc1cc(O)cc2[C@@H]3CCC[C@@H]3[C@@H](Oc12)c1ccc(O)cc1
InChI Key: InChIKey=QWVYYRIOJUYPDZ-GJYPPUQNSA-N
Data: 2 KI
PDB links: 3 PDB IDs contain this monomer as substructures. 3 PDB IDs contain inhibitors having a similarity of 90% to this monomer.
Activity Spreadsheet -- Enzyme Inhibition Constant Data from BindingDB
Found 2 hits for monomerid = 19986
Trg + Lig
Ki
nM
ΔG°
kcal/mole
IC50
nM
Kd
nM
EC50/IC50
nM
koff
s-1
kon
M-1s-1
pHTemp
°C
Estradiol receptor beta (ERβ)
(Homo sapiens (Human))
BDBM19986
((2R,6S,7R)-7-(4-hydroxyphenyl)-10-methyl-8-oxatric...)
Show SMILES Cc1cc(O)cc2[C@@H]3CCC[C@@H]3[C@@H](Oc12)c1ccc(O)cc1 |r|
Show InChI InChI=1S/C19H20O3/c1-11-9-14(21)10-17-15-3-2-4-16(15)19(22-18(11)17)12-5-7-13(20)8-6-12/h5-10,15-16,19-21H,2-4H2,1H3/t15-,16+,19+/m1/s1
0.260 -12.9n/an/an/an/an/a7.522
Lilly Research Laboratories
Assay Description
The binding affinities were determined by a competitive radiometric binding assay using [3H]estradiol as tracer. The Kd for 3H-estradiol was determin...
Bioorg Med Chem Lett 17: 5082-5 (2007)
Article DOI: 10.1016/j.bmcl.2007.07.009
BindingDB Entry DOI: 10.7270/Q27S7M2Q
Estrogen receptor
(Homo sapiens (Human))
BDBM19986
((2R,6S,7R)-7-(4-hydroxyphenyl)-10-methyl-8-oxatric...)
Show SMILES Cc1cc(O)cc2[C@@H]3CCC[C@@H]3[C@@H](Oc12)c1ccc(O)cc1 |r|
Show InChI InChI=1S/C19H20O3/c1-11-9-14(21)10-17-15-3-2-4-16(15)19(22-18(11)17)12-5-7-13(20)8-6-12/h5-10,15-16,19-21H,2-4H2,1H3/t15-,16+,19+/m1/s1
2.82 -11.5n/an/an/an/an/a7.522
Lilly Research Laboratories
Assay Description
The binding affinities were determined by a competitive radiometric binding assay using [3H]estradiol as tracer. The Kd for 3H-estradiol was determin...
Bioorg Med Chem Lett 17: 5082-5 (2007)
Article DOI: 10.1016/j.bmcl.2007.07.009
BindingDB Entry DOI: 10.7270/Q27S7M2Q