null
SMILES: CCOc1ccc(C[C@@H](N)C(=O)N[C@@H](Cc2ccccc2)C(=O)NCc2ccc(CN)cc2)cc1
InChI Key: InChIKey=CKNDVDLSIUTQOV-FTJBHMTQSA-N
Activity Spreadsheet -- Enzyme Inhibition Constant Data from BindingDB
Found 2 hits for monomerid = 200014
Trg + Lig
Ki
nM
ΔG°
kcal/mole
IC50
nM
Kd
nM
EC50/IC50
nM
koff
s-1
kon
M-1s-1
pHTemp
°C
Kallikrein-1
(Homo sapiens (Human))
BDBM200014
(US9234000, 5)
Show SMILES CCOc1ccc(C[C@@H](N)C(=O)N[C@@H](Cc2ccccc2)C(=O)NCc2ccc(CN)cc2)cc1
Show InChI InChI=1S/C28H34N4O3/c1-2-35-24-14-12-21(13-15-24)16-25(30)27(33)32-26(17-20-6-4-3-5-7-20)28(34)31-19-23-10-8-22(18-29)9-11-23/h3-15,25-26H,2,16-19,29-30H2,1H3,(H,31,34)(H,32,33)/t25-,26+/m1/s1
US Patent
n/an/a 160n/an/an/an/an/an/a
Kalvista Pharmaceuticals Limited
US Patent
Assay Description
KLK1 inhibitory activity in vitro was determined using standard published methods (see e.g. Johansen et al., Int. J. Tiss. Reac. 1986, 8, 185; Shori ...
US Patent US9234000 (2016)
BindingDB Entry DOI: 10.7270/Q2X065W0
Plasma kallikrein
(Homo sapiens (Human))
BDBM200014
(US9234000, 5)
Show SMILES CCOc1ccc(C[C@@H](N)C(=O)N[C@@H](Cc2ccccc2)C(=O)NCc2ccc(CN)cc2)cc1
Show InChI InChI=1S/C28H34N4O3/c1-2-35-24-14-12-21(13-15-24)16-25(30)27(33)32-26(17-20-6-4-3-5-7-20)28(34)31-19-23-10-8-22(18-29)9-11-23/h3-15,25-26H,2,16-19,29-30H2,1H3,(H,31,34)(H,32,33)/t25-,26+/m1/s1
US Patent
n/an/a 460n/an/an/an/an/an/a
Kalvista Pharmaceuticals Limited
US Patent
Assay Description
Plasma kallikrein inhibitory activity in vitro was determined using standard published methods (see e.g. Johansen et al., Int. J. Tiss. Reac. 1986, 8...
US Patent US9234000 (2016)
BindingDB Entry DOI: 10.7270/Q2X065W0