BDBM20023 2-{4-[({3-[3-benzoyl-8-(trifluoromethyl)quinolin-4-yl]phenyl}amino)methyl]phenyl}-2,2-difluoroacetic acid::phenyl acetic acid based quinoline, 35
SMILES: OC(=O)C(F)(F)c1ccc(CNc2cccc(c2)-c2c(cnc3c(cccc23)C(F)(F)F)C(=O)c2ccccc2)cc1
InChI Key: InChIKey=DUOZJJLSLMAQCI-UHFFFAOYSA-N
Data: 2 IC50  1 EC50
Activity Spreadsheet -- Enzyme Inhibition Constant Data from BindingDB
Found 2 hits for monomerid = 20023
Trg + Lig
Ki
nM
ΔG°
kcal/mole
IC50
nM
Kd
nM
EC50/IC50
nM
koff
s-1
kon
M-1s-1
pHTemp
°C
Liver X Receptor beta (LXR-beta)
(Homo sapiens (Human))
BDBM20023
(2-{4-[({3-[3-benzoyl-8-(trifluoromethyl)quinolin-4...)
Show SMILES OC(=O)C(F)(F)c1ccc(CNc2cccc(c2)-c2c(cnc3c(cccc23)C(F)(F)F)C(=O)c2ccccc2)cc1
Show InChI InChI=1S/C32H21F5N2O3/c33-31(34,30(41)42)22-14-12-19(13-15-22)17-38-23-9-4-8-21(16-23)27-24-10-5-11-26(32(35,36)37)28(24)39-18-25(27)29(40)20-6-2-1-3-7-20/h1-16,18,38H,17H2,(H,41,42)
n/an/a 7.80n/a 2.40E+3n/an/an/an/a
Wyeth Research
Assay Description
Binding reaction was initiated by adding a dilution series of test compound in tracer solution to LXR-coated flash plates. Each concentration of test...
Bioorg Med Chem 15: 3321-33 (2007)
Article DOI: 10.1016/j.bmc.2007.03.013
BindingDB Entry DOI: 10.7270/Q2VH5M37
Liver X Receptor alpha (LXR-alpha)
(Homo sapiens (Human))
BDBM20023
(2-{4-[({3-[3-benzoyl-8-(trifluoromethyl)quinolin-4...)
Show SMILES OC(=O)C(F)(F)c1ccc(CNc2cccc(c2)-c2c(cnc3c(cccc23)C(F)(F)F)C(=O)c2ccccc2)cc1
Show InChI InChI=1S/C32H21F5N2O3/c33-31(34,30(41)42)22-14-12-19(13-15-22)17-38-23-9-4-8-21(16-23)27-24-10-5-11-26(32(35,36)37)28(24)39-18-25(27)29(40)20-6-2-1-3-7-20/h1-16,18,38H,17H2,(H,41,42)
Reactome pathway
n/an/a 30.2n/an/an/an/a7.44
Wyeth Research
Assay Description
Binding reaction was initiated by adding a dilution series of test compound in tracer solution to LXR-coated flash plates. Each concentration of test...
Bioorg Med Chem 15: 3321-33 (2007)
Article DOI: 10.1016/j.bmc.2007.03.013
BindingDB Entry DOI: 10.7270/Q2VH5M37