BDBM200503 US9670231, 1.31
SMILES: CN(C)[C@@H]1CCCN(Cc2ccc(cc2C(F)(F)F)C(=O)N[C@@H]2[C@H]3Oc4ccc(Oc5ccnc6NC(=O)CCc56)cc4[C@@H]23)C1
InChI Key: InChIKey=DRWSMZPVRXENHA-KRUKBSHNSA-N
Data: 5 IC50
Activity Spreadsheet -- Enzyme Inhibition Constant Data from BindingDB
Found 5 hits for monomerid = 200503
Trg + Lig
Ki
nM
ΔG°
kcal/mole
IC50
nM
Kd
nM
EC50/IC50
nM
koff
s-1
kon
M-1s-1
pHTemp
°C
B-RAF V600E
(Homo sapiens (Human))
BDBM200503
(US9670231, 1.31)
Show SMILES CN(C)[C@@H]1CCCN(Cc2ccc(cc2C(F)(F)F)C(=O)N[C@@H]2[C@H]3Oc4ccc(Oc5ccnc6NC(=O)CCc56)cc4[C@@H]23)C1 |r|
Show InChI InChI=1S/C33H34F3N5O4/c1-40(2)20-4-3-13-41(17-20)16-19-6-5-18(14-24(19)33(34,35)36)32(43)39-29-28-23-15-21(7-9-25(23)45-30(28)29)44-26-11-12-37-31-22(26)8-10-27(42)38-31/h5-7,9,11-12,14-15,20,28-30H,3-4,8,10,13,16-17H2,1-2H3,(H,39,43)(H,37,38,42)/t20-,28+,29+,30+/m1/s1
US Patent
n/an/a 15n/an/an/an/an/an/a
BeiGene, Ltd.
US Patent
Assay Description
TBD
US Patent US9670231 (2017)
BindingDB Entry DOI: 10.7270/Q2F18WWF
RAF proto-oncogene serine/threonine-protein kinase
(Homo sapiens (Human))
BDBM200503
(US9670231, 1.31)
Show SMILES CN(C)[C@@H]1CCCN(Cc2ccc(cc2C(F)(F)F)C(=O)N[C@@H]2[C@H]3Oc4ccc(Oc5ccnc6NC(=O)CCc56)cc4[C@@H]23)C1 |r|
Show InChI InChI=1S/C33H34F3N5O4/c1-40(2)20-4-3-13-41(17-20)16-19-6-5-18(14-24(19)33(34,35)36)32(43)39-29-28-23-15-21(7-9-25(23)45-30(28)29)44-26-11-12-37-31-22(26)8-10-27(42)38-31/h5-7,9,11-12,14-15,20,28-30H,3-4,8,10,13,16-17H2,1-2H3,(H,39,43)(H,37,38,42)/t20-,28+,29+,30+/m1/s1
NCI pathway
Reactome pathway
US Patent
n/an/a 0.780n/an/an/an/an/an/a
BeiGene, Ltd.
US Patent
Assay Description
TBD
US Patent US9670231 (2017)
BindingDB Entry DOI: 10.7270/Q2F18WWF
Epidermal growth factor receptor(L858R, T790M)
(Homo sapiens (Human))
BDBM200503
(US9670231, 1.31)
Show SMILES CN(C)[C@@H]1CCCN(Cc2ccc(cc2C(F)(F)F)C(=O)N[C@@H]2[C@H]3Oc4ccc(Oc5ccnc6NC(=O)CCc56)cc4[C@@H]23)C1 |r|
Show InChI InChI=1S/C33H34F3N5O4/c1-40(2)20-4-3-13-41(17-20)16-19-6-5-18(14-24(19)33(34,35)36)32(43)39-29-28-23-15-21(7-9-25(23)45-30(28)29)44-26-11-12-37-31-22(26)8-10-27(42)38-31/h5-7,9,11-12,14-15,20,28-30H,3-4,8,10,13,16-17H2,1-2H3,(H,39,43)(H,37,38,42)/t20-,28+,29+,30+/m1/s1
US Patent
n/an/a 1.90n/an/an/an/an/an/a
BeiGene, Ltd.
US Patent
Assay Description
TBD
US Patent US9670231 (2017)
BindingDB Entry DOI: 10.7270/Q2F18WWF
Epidermal growth factor receptor(L858R)
(Homo sapiens (Human))
BDBM200503
(US9670231, 1.31)
Show SMILES CN(C)[C@@H]1CCCN(Cc2ccc(cc2C(F)(F)F)C(=O)N[C@@H]2[C@H]3Oc4ccc(Oc5ccnc6NC(=O)CCc56)cc4[C@@H]23)C1 |r|
Show InChI InChI=1S/C33H34F3N5O4/c1-40(2)20-4-3-13-41(17-20)16-19-6-5-18(14-24(19)33(34,35)36)32(43)39-29-28-23-15-21(7-9-25(23)45-30(28)29)44-26-11-12-37-31-22(26)8-10-27(42)38-31/h5-7,9,11-12,14-15,20,28-30H,3-4,8,10,13,16-17H2,1-2H3,(H,39,43)(H,37,38,42)/t20-,28+,29+,30+/m1/s1
US Patent
n/an/a 0.440n/an/an/an/an/an/a
BeiGene, Ltd.
US Patent
Assay Description
TBD
US Patent US9670231 (2017)
BindingDB Entry DOI: 10.7270/Q2F18WWF
Epidermal growth factor receptor
(Homo sapiens (Human))
BDBM200503
(US9670231, 1.31)
Show SMILES CN(C)[C@@H]1CCCN(Cc2ccc(cc2C(F)(F)F)C(=O)N[C@@H]2[C@H]3Oc4ccc(Oc5ccnc6NC(=O)CCc56)cc4[C@@H]23)C1 |r|
Show InChI InChI=1S/C33H34F3N5O4/c1-40(2)20-4-3-13-41(17-20)16-19-6-5-18(14-24(19)33(34,35)36)32(43)39-29-28-23-15-21(7-9-25(23)45-30(28)29)44-26-11-12-37-31-22(26)8-10-27(42)38-31/h5-7,9,11-12,14-15,20,28-30H,3-4,8,10,13,16-17H2,1-2H3,(H,39,43)(H,37,38,42)/t20-,28+,29+,30+/m1/s1
US Patent
n/an/a 0.990n/an/an/an/an/an/a
BeiGene, Ltd.
US Patent
Assay Description
TBD
US Patent US9670231 (2017)
BindingDB Entry DOI: 10.7270/Q2F18WWF