BDBM20065 5-Substituted-6-chlorouracil, 10a::6-chloro-5-phenyl-1,2,3,4-tetrahydropyrimidine-2,4-dione
SMILES: Clc1[nH]c(=O)[nH]c(=O)c1-c1ccccc1
InChI Key: InChIKey=ORRYLQRWCPCGJZ-UHFFFAOYSA-N
Data: 1 KI
Activity Spreadsheet -- Enzyme Inhibition Constant Data from BindingDB
Found 1 hit for monomerid = 20065
Trg + Lig
Ki
nM
ΔG°
kcal/mole
IC50
nM
Kd
nM
EC50/IC50
nM
koff
s-1
kon
M-1s-1
pHTemp
°C
Thymidine Phosphorylase (TP)
(Homo sapiens (Human))
BDBM20065
(5-Substituted-6-chlorouracil, 10a | 6-chloro-5-phe...)
Show SMILES Clc1[nH]c(=O)[nH]c(=O)c1-c1ccccc1
Show InChI InChI=1S/C10H7ClN2O2/c11-8-7(6-4-2-1-3-5-6)9(14)13-10(15)12-8/h1-5H,(H2,12,13,14,15)
Reactome pathway
400 -9.07n/an/an/an/an/a6.437
Gilead Sciences Inc.
Assay Description
The enzyme reaction was started by the addition of enzyme to the reaction mixture containing substrate and test compounds. The reaction was stopped b...
J Med Chem 50: 6016-23 (2007)
Article DOI: 10.1021/jm070644i
BindingDB Entry DOI: 10.7270/Q2M043PX