BDBM20067 5-Substituted-6-chlorouracil, 10c::6-chloro-5-(naphthalen-1-yl)-1,2,3,4-tetrahydropyrimidine-2,4-dione
SMILES: Clc1[nH]c(=O)[nH]c(=O)c1-c1cccc2ccccc12
InChI Key: InChIKey=UVHCRAHBQXOTTO-UHFFFAOYSA-N
Data: 1 KI
Activity Spreadsheet -- Enzyme Inhibition Constant Data from BindingDB
Found 1 hit for monomerid = 20067
Trg + Lig
Ki
nM
ΔG°
kcal/mole
IC50
nM
Kd
nM
EC50/IC50
nM
koff
s-1
kon
M-1s-1
pHTemp
°C
Thymidine Phosphorylase (TP)
(Homo sapiens (Human))
BDBM20067
(5-Substituted-6-chlorouracil, 10c | 6-chloro-5-(na...)
Show SMILES Clc1[nH]c(=O)[nH]c(=O)c1-c1cccc2ccccc12 |(.16,2.02,;-1.17,2.79,;-2.51,2.02,;-3.84,2.79,;-5.18,2.02,;-3.84,4.33,;-2.51,5.1,;-2.51,6.64,;-1.17,4.33,;.16,5.1,;.16,6.64,;1.49,7.41,;2.83,6.64,;2.83,5.1,;4.16,4.33,;4.16,2.79,;2.83,2.02,;1.49,2.79,;1.49,4.33,)|
Show InChI InChI=1S/C14H9ClN2O2/c15-12-11(13(18)17-14(19)16-12)10-7-3-5-8-4-1-2-6-9(8)10/h1-7H,(H2,16,17,18,19)
Reactome pathway
4.59E+3 -7.57n/an/an/an/an/a6.437
Gilead Sciences Inc.
Assay Description
The enzyme reaction was started by the addition of enzyme to the reaction mixture containing substrate and test compounds. The reaction was stopped b...
J Med Chem 50: 6016-23 (2007)
Article DOI: 10.1021/jm070644i
BindingDB Entry DOI: 10.7270/Q2M043PX