BDBM200749 US9233108, 11::US9757383, Example 11
SMILES: CN(CCCn1c2ccc(CNC[C@H](O)c3ccc(O)c4[nH]c(=O)ccc34)cc2sc1=O)[C@H]1CC[C@@H](CC1)OC(=O)C(O)(c1cccs1)c1cccs1
InChI Key: InChIKey=XJHGFZGUOALOCT-LNFMTQTQSA-N
Data: 4 IC50
Activity Spreadsheet -- Enzyme Inhibition Constant Data from BindingDB
Found 4 hits for monomerid = 200749
Trg + Lig
Ki
nM
ΔG°
kcal/mole
IC50
nM
Kd
nM
EC50/IC50
nM
koff
s-1
kon
M-1s-1
pHTemp
°C
Beta-2 adrenergic receptor
(Homo sapiens (Human))
BDBM200749
(US9233108, 11 | US9757383, Example 11)
Show SMILES CN(CCCn1c2ccc(CNC[C@H](O)c3ccc(O)c4[nH]c(=O)ccc34)cc2sc1=O)[C@H]1CC[C@@H](CC1)OC(=O)C(O)(c1cccs1)c1cccs1 |wU:35.42,wD:13.13,32.35,(1.12,5.55,;2.62,5.23,;3.1,3.77,;2.07,2.62,;2.54,1.16,;1.51,.02,;1.83,-1.49,;3.17,-2.26,;3.17,-3.8,;1.83,-4.57,;1.83,-6.11,;3.17,-6.88,;3.17,-8.42,;4.5,-9.19,;5.84,-8.42,;4.5,-10.73,;3.17,-11.5,;3.17,-13.04,;4.5,-13.81,;4.5,-15.35,;5.84,-13.04,;7.17,-13.81,;8.5,-13.04,;9.84,-13.81,;8.5,-11.5,;7.17,-10.73,;5.84,-11.5,;.5,-3.8,;.5,-2.26,;-.64,-1.23,;-.02,.18,;-.79,1.51,;3.65,6.38,;5.16,6.06,;6.19,7.2,;5.71,8.67,;4.21,8.99,;3.18,7.84,;6.75,9.81,;6.27,11.28,;4.76,11.6,;7.3,12.42,;8.44,11.39,;8.33,13.56,;8.01,15.07,;9.34,15.84,;10.49,14.81,;9.86,13.4,;6.16,13.45,;4.65,13.13,;3.88,14.46,;4.91,15.61,;6.32,14.98,)|
Show InChI InChI=1S/C39H42N4O7S3/c1-42(25-8-10-26(11-9-25)50-37(47)39(49,33-5-2-19-51-33)34-6-3-20-52-34)17-4-18-43-29-14-7-24(21-32(29)53-38(43)48)22-40-23-31(45)27-12-15-30(44)36-28(27)13-16-35(46)41-36/h2-3,5-7,12-16,19-21,25-26,31,40,44-45,49H,4,8-11,17-18,22-23H2,1H3,(H,41,46)/t25-,26-,31-/m0/s1
Reactome pathway
US Patent
n/an/a 4.20n/an/an/an/an/a25
ALMIRALL, S.A.
US Patent
Assay Description
The study of binding to human adrenergic beta1 and beta2 receptors was performed using commercial membranes prepared from Sf9 cells where they are ov...
US Patent US9233108 (2016)
BindingDB Entry DOI: 10.7270/Q23J3BSN
Muscarinic acetylcholine receptor M3
(Homo sapiens (Human))
BDBM200749
(US9233108, 11 | US9757383, Example 11)
Show SMILES CN(CCCn1c2ccc(CNC[C@H](O)c3ccc(O)c4[nH]c(=O)ccc34)cc2sc1=O)[C@H]1CC[C@@H](CC1)OC(=O)C(O)(c1cccs1)c1cccs1 |wU:35.42,wD:13.13,32.35,(1.12,5.55,;2.62,5.23,;3.1,3.77,;2.07,2.62,;2.54,1.16,;1.51,.02,;1.83,-1.49,;3.17,-2.26,;3.17,-3.8,;1.83,-4.57,;1.83,-6.11,;3.17,-6.88,;3.17,-8.42,;4.5,-9.19,;5.84,-8.42,;4.5,-10.73,;3.17,-11.5,;3.17,-13.04,;4.5,-13.81,;4.5,-15.35,;5.84,-13.04,;7.17,-13.81,;8.5,-13.04,;9.84,-13.81,;8.5,-11.5,;7.17,-10.73,;5.84,-11.5,;.5,-3.8,;.5,-2.26,;-.64,-1.23,;-.02,.18,;-.79,1.51,;3.65,6.38,;5.16,6.06,;6.19,7.2,;5.71,8.67,;4.21,8.99,;3.18,7.84,;6.75,9.81,;6.27,11.28,;4.76,11.6,;7.3,12.42,;8.44,11.39,;8.33,13.56,;8.01,15.07,;9.34,15.84,;10.49,14.81,;9.86,13.4,;6.16,13.45,;4.65,13.13,;3.88,14.46,;4.91,15.61,;6.32,14.98,)|
Show InChI InChI=1S/C39H42N4O7S3/c1-42(25-8-10-26(11-9-25)50-37(47)39(49,33-5-2-19-51-33)34-6-3-20-52-34)17-4-18-43-29-14-7-24(21-32(29)53-38(43)48)22-40-23-31(45)27-12-15-30(44)36-28(27)13-16-35(46)41-36/h2-3,5-7,12-16,19-21,25-26,31,40,44-45,49H,4,8-11,17-18,22-23H2,1H3,(H,41,46)/t25-,26-,31-/m0/s1
Reactome pathway
US Patent
n/an/a 0.5n/an/an/an/an/an/a
Almirall, S.A.
US Patent
Assay Description
The study of binding to human muscarinic M1, M2, M3, M4 and M5 receptors was performed using commercial membranes (Perkin Elmer) prepared from CHO-K1...
US Patent US9757383 (2017)
BindingDB Entry DOI: 10.7270/Q2HX1FSN
Beta-2 adrenergic receptor
(Homo sapiens (Human))
BDBM200749
(US9233108, 11 | US9757383, Example 11)
Show SMILES CN(CCCn1c2ccc(CNC[C@H](O)c3ccc(O)c4[nH]c(=O)ccc34)cc2sc1=O)[C@H]1CC[C@@H](CC1)OC(=O)C(O)(c1cccs1)c1cccs1 |wU:35.42,wD:13.13,32.35,(1.12,5.55,;2.62,5.23,;3.1,3.77,;2.07,2.62,;2.54,1.16,;1.51,.02,;1.83,-1.49,;3.17,-2.26,;3.17,-3.8,;1.83,-4.57,;1.83,-6.11,;3.17,-6.88,;3.17,-8.42,;4.5,-9.19,;5.84,-8.42,;4.5,-10.73,;3.17,-11.5,;3.17,-13.04,;4.5,-13.81,;4.5,-15.35,;5.84,-13.04,;7.17,-13.81,;8.5,-13.04,;9.84,-13.81,;8.5,-11.5,;7.17,-10.73,;5.84,-11.5,;.5,-3.8,;.5,-2.26,;-.64,-1.23,;-.02,.18,;-.79,1.51,;3.65,6.38,;5.16,6.06,;6.19,7.2,;5.71,8.67,;4.21,8.99,;3.18,7.84,;6.75,9.81,;6.27,11.28,;4.76,11.6,;7.3,12.42,;8.44,11.39,;8.33,13.56,;8.01,15.07,;9.34,15.84,;10.49,14.81,;9.86,13.4,;6.16,13.45,;4.65,13.13,;3.88,14.46,;4.91,15.61,;6.32,14.98,)|
Show InChI InChI=1S/C39H42N4O7S3/c1-42(25-8-10-26(11-9-25)50-37(47)39(49,33-5-2-19-51-33)34-6-3-20-52-34)17-4-18-43-29-14-7-24(21-32(29)53-38(43)48)22-40-23-31(45)27-12-15-30(44)36-28(27)13-16-35(46)41-36/h2-3,5-7,12-16,19-21,25-26,31,40,44-45,49H,4,8-11,17-18,22-23H2,1H3,(H,41,46)/t25-,26-,31-/m0/s1
Reactome pathway
US Patent
n/an/a 4.20n/an/an/an/an/an/a
Almirall, S.A.
US Patent
Assay Description
The study of binding to human adrenergic beta1 and beta2 receptors was performed using commercial membranes prepared from Sf9 cells where they are ov...
US Patent US9757383 (2017)
BindingDB Entry DOI: 10.7270/Q2HX1FSN
Muscarinic acetylcholine receptor M3
(Homo sapiens (Human))
BDBM200749
(US9233108, 11 | US9757383, Example 11)
Show SMILES CN(CCCn1c2ccc(CNC[C@H](O)c3ccc(O)c4[nH]c(=O)ccc34)cc2sc1=O)[C@H]1CC[C@@H](CC1)OC(=O)C(O)(c1cccs1)c1cccs1 |wU:35.42,wD:13.13,32.35,(1.12,5.55,;2.62,5.23,;3.1,3.77,;2.07,2.62,;2.54,1.16,;1.51,.02,;1.83,-1.49,;3.17,-2.26,;3.17,-3.8,;1.83,-4.57,;1.83,-6.11,;3.17,-6.88,;3.17,-8.42,;4.5,-9.19,;5.84,-8.42,;4.5,-10.73,;3.17,-11.5,;3.17,-13.04,;4.5,-13.81,;4.5,-15.35,;5.84,-13.04,;7.17,-13.81,;8.5,-13.04,;9.84,-13.81,;8.5,-11.5,;7.17,-10.73,;5.84,-11.5,;.5,-3.8,;.5,-2.26,;-.64,-1.23,;-.02,.18,;-.79,1.51,;3.65,6.38,;5.16,6.06,;6.19,7.2,;5.71,8.67,;4.21,8.99,;3.18,7.84,;6.75,9.81,;6.27,11.28,;4.76,11.6,;7.3,12.42,;8.44,11.39,;8.33,13.56,;8.01,15.07,;9.34,15.84,;10.49,14.81,;9.86,13.4,;6.16,13.45,;4.65,13.13,;3.88,14.46,;4.91,15.61,;6.32,14.98,)|
Show InChI InChI=1S/C39H42N4O7S3/c1-42(25-8-10-26(11-9-25)50-37(47)39(49,33-5-2-19-51-33)34-6-3-20-52-34)17-4-18-43-29-14-7-24(21-32(29)53-38(43)48)22-40-23-31(45)27-12-15-30(44)36-28(27)13-16-35(46)41-36/h2-3,5-7,12-16,19-21,25-26,31,40,44-45,49H,4,8-11,17-18,22-23H2,1H3,(H,41,46)/t25-,26-,31-/m0/s1
Reactome pathway
US Patent
n/an/a 0.5n/an/an/an/an/an/a
ALMIRALL, S.A.
US Patent
Assay Description
The study of binding to human muscarinic M1, M2, M3, M4 and M5 receptors was performed using commercial membranes (Perkin Elmer) prepared from CHO-K1...
US Patent US9233108 (2016)
BindingDB Entry DOI: 10.7270/Q23J3BSN