BDBM20078 6-[(2-Aminoethyl)amino]-5-phenylpyrimidine-2,4(1H,3H)-dione, 25::6-[(2-aminoethyl)amino]-5-phenyl-1,2,3,4-tetrahydropyrimidine-2,4-dione
SMILES: NCCNc1[nH]c(=O)[nH]c(=O)c1-c1ccccc1
InChI Key: InChIKey=BVRMCKUFYXTZJR-UHFFFAOYSA-N
Data: 1 KI
Activity Spreadsheet -- Enzyme Inhibition Constant Data from BindingDB
Found 1 hit for monomerid = 20078
Trg + Lig
Ki
nM
ΔG°
kcal/mole
IC50
nM
Kd
nM
EC50/IC50
nM
koff
s-1
kon
M-1s-1
pHTemp
°C
Thymidine Phosphorylase (TP)
(Homo sapiens (Human))
BDBM20078
(6-[(2-Aminoethyl)amino]-5-phenylpyrimidine-2,4(1H,...)
Show SMILES NCCNc1[nH]c(=O)[nH]c(=O)c1-c1ccccc1
Show InChI InChI=1S/C12H14N4O2/c13-6-7-14-10-9(8-4-2-1-3-5-8)11(17)16-12(18)15-10/h1-5H,6-7,13H2,(H3,14,15,16,17,18)
Reactome pathway
>2.00E+4>-6.66n/an/an/an/an/a6.437
Gilead Sciences Inc.
Assay Description
The enzyme reaction was started by the addition of enzyme to the reaction mixture containing substrate and test compounds. The reaction was stopped b...
J Med Chem 50: 6016-23 (2007)
Article DOI: 10.1021/jm070644i
BindingDB Entry DOI: 10.7270/Q2M043PX