BDBM200862 US9533999, i-18
SMILES: COC(=O)c1ccc2c(n1)N(Cc1ccc(F)c(OC(F)(F)F)c1)C(=O)CS2(=O)=O
InChI Key: InChIKey=JQSANEJRICRWIB-UHFFFAOYSA-N
Data: 1 IC50
Activity Spreadsheet -- Enzyme Inhibition Constant Data from BindingDB
Found 1 hit for monomerid = 200862
Trg + Lig
Ki
nM
ΔG°
kcal/mole
IC50
nM
Kd
nM
EC50/IC50
nM
koff
s-1
kon
M-1s-1
pHTemp
°C
Intermediate conductance calcium-activated potassium channel protein 4
(Homo sapiens (Human))
BDBM200862
(US9533999, i-18)
Show SMILES COC(=O)c1ccc2c(n1)N(Cc1ccc(F)c(OC(F)(F)F)c1)C(=O)CS2(=O)=O
Show InChI InChI=1S/C17H12F4N2O6S/c1-28-16(25)11-4-5-13-15(22-11)23(14(24)8-30(13,26)27)7-9-2-3-10(18)12(6-9)29-17(19,20)21/h2-6H,7-8H2,1H3
Reactome pathway
US Patent
n/an/a 88n/an/an/an/an/an/a
Boehringer Ingelheim International GmbH
US Patent
Assay Description
HEK293 cells over-expressing human KCa3.1 are used to measure the effects of compounds in inhibiting the KCa3.1 channel function. The assay is based ...
US Patent US9533999 (2017)
BindingDB Entry DOI: 10.7270/Q21V5C4S