null
SMILES: CC(N1c2sccc2S(=O)(=O)CC1=O)c1cccc(c1)C(F)(F)F
InChI Key: InChIKey=BOQNLOZFRLYYQW-UHFFFAOYSA-N
Activity Spreadsheet -- Enzyme Inhibition Constant Data from BindingDB
Found 1 hit for monomerid = 200904
Trg + Lig
Ki
nM
ΔG°
kcal/mole
IC50
nM
Kd
nM
EC50/IC50
nM
koff
s-1
kon
M-1s-1
pHTemp
°C
Intermediate conductance calcium-activated potassium channel protein 4
(Homo sapiens (Human))
BDBM200904
(US9533999, i-38)
Show SMILES CC(N1c2sccc2S(=O)(=O)CC1=O)c1cccc(c1)C(F)(F)F
Show InChI InChI=1S/C15H12F3NO3S2/c1-9(10-3-2-4-11(7-10)15(16,17)18)19-13(20)8-24(21,22)12-5-6-23-14(12)19/h2-7,9H,8H2,1H3
Reactome pathway
US Patent
n/an/a 71n/an/an/an/an/an/a
Boehringer Ingelheim International GmbH
US Patent
Assay Description
HEK293 cells over-expressing human KCa3.1 are used to measure the effects of compounds in inhibiting the KCa3.1 channel function. The assay is based ...
US Patent US9533999 (2017)
BindingDB Entry DOI: 10.7270/Q21V5C4S