BDBM200934 US9233946, 33
SMILES: Cc1c(sc2ccc(C)cc12)S(=O)(=O)Nc1cccc(c1)-c1nnn[nH]1
InChI Key: InChIKey=XERICNKIDOUEQL-UHFFFAOYSA-N
Data: 1 IC50
Activity Spreadsheet -- Enzyme Inhibition Constant Data from BindingDB
Found 1 hit for monomerid = 200934
Trg + Lig
Ki
nM
ΔG°
kcal/mole
IC50
nM
Kd
nM
EC50/IC50
nM
koff
s-1
kon
M-1s-1
pHTemp
°C
6-phosphofructo-2-kinase/fructose-2,6-bisphosphatase 3 (PFKFB3)
(Homo sapiens (Human))
BDBM200934
(US9233946, 33)
Show SMILES Cc1c(sc2ccc(C)cc12)S(=O)(=O)Nc1cccc(c1)-c1nnn[nH]1
Show InChI InChI=1S/C17H15N5O2S2/c1-10-6-7-15-14(8-10)11(2)17(25-15)26(23,24)20-13-5-3-4-12(9-13)16-18-21-22-19-16/h3-9,20H,1-2H3,(H,18,19,21,22)
US Patent
n/an/a 130n/an/an/an/an/an/a
KANCERA AB
US Patent
Assay Description
Method B: The kinase activity of the bi-functional enzyme is readily quantified based on the production of ADP and F-2,6-P2 from ATP and F6P. The ADP...
US Patent US9233946 (2016)
BindingDB Entry DOI: 10.7270/Q2V123KB