BDBM20103 dipeptide-derived nitrile, 24::tert-butyl N-[(1S)-1-[(cyanomethyl)carbamoyl]-2-(4-fluorophenyl)ethyl]carbamate
SMILES: CC(C)(C)OC(=O)N[C@@H](Cc1ccc(F)cc1)C(=O)NCC#N
InChI Key: InChIKey=LBPWPYULLFYAQF-ZDUSSCGKSA-N
Data: 5 KI
Activity Spreadsheet -- Enzyme Inhibition Constant Data from BindingDB
Found 5 hits for monomerid = 20103
Trg + Lig
Ki
nM
ΔG°
kcal/mole
IC50
nM
Kd
nM
EC50/IC50
nM
koff
s-1
kon
M-1s-1
pHTemp
°C
Papain
(Carica papaya)
BDBM20103
(dipeptide-derived nitrile, 24 | tert-butyl N-[(1S)...)
Show SMILES CC(C)(C)OC(=O)N[C@@H](Cc1ccc(F)cc1)C(=O)NCC#N |r|
Show InChI InChI=1S/C16H20FN3O3/c1-16(2,3)23-15(22)20-13(14(21)19-9-8-18)10-11-4-6-12(17)7-5-11/h4-7,13H,9-10H2,1-3H3,(H,19,21)(H,20,22)/t13-/m0/s1
270 -8.95n/an/an/an/an/a6.525
Rheinische Friedrich-Wilhelms-Universitat Bonn
Assay Description
Enzyme activities were calculated from kinetic measurements performed by spectrophotometric detection of the product p-nitroaniline (pNA) at waveleng...
J Med Chem 48: 7688-707 (2005)
Article DOI: 10.1021/jm050686b
BindingDB Entry DOI: 10.7270/Q2GB22BG
Cathepsin B
(Homo sapiens (Human))
BDBM20103
(dipeptide-derived nitrile, 24 | tert-butyl N-[(1S)...)
Show SMILES CC(C)(C)OC(=O)N[C@@H](Cc1ccc(F)cc1)C(=O)NCC#N |r|
Show InChI InChI=1S/C16H20FN3O3/c1-16(2,3)23-15(22)20-13(14(21)19-9-8-18)10-11-4-6-12(17)7-5-11/h4-7,13H,9-10H2,1-3H3,(H,19,21)(H,20,22)/t13-/m0/s1
Reactome pathway
>330n/an/an/an/an/an/a6.0n/a
University of Bonn
Curated by ChEMBL
Assay Description
Inhibition of human liver cathepsin B using Cbz-Arg-Arg-pNA as substrate at pH 6 incubated for 30 mins measured for 20 mins by photometrical analysis
ACS Med Chem Lett 7: 211-6 (2016)
BindingDB Entry DOI: 10.7270/Q2TH8PMM
Cathepsin S
(Homo sapiens (Human))
BDBM20103
(dipeptide-derived nitrile, 24 | tert-butyl N-[(1S)...)
Show SMILES CC(C)(C)OC(=O)N[C@@H](Cc1ccc(F)cc1)C(=O)NCC#N |r|
Show InChI InChI=1S/C16H20FN3O3/c1-16(2,3)23-15(22)20-13(14(21)19-9-8-18)10-11-4-6-12(17)7-5-11/h4-7,13H,9-10H2,1-3H3,(H,19,21)(H,20,22)/t13-/m0/s1
Reactome pathway
590n/an/an/an/an/an/an/an/a
Rheinische Friedrich-Wilhelms-Universitat Bonn
Assay Description
Enzyme activities were calculated from kinetic measurements performed by fluorimetric detection of the product AMC at the wavelengths for excitation ...
J Med Chem 48: 7688-707 (2005)
Article DOI: 10.1021/jm050686b
BindingDB Entry DOI: 10.7270/Q2GB22BG
Cathepsin L
(Bos taurus (bovine))
BDBM20103
(dipeptide-derived nitrile, 24 | tert-butyl N-[(1S)...)
Show SMILES CC(C)(C)OC(=O)N[C@@H](Cc1ccc(F)cc1)C(=O)NCC#N |r|
Show InChI InChI=1S/C16H20FN3O3/c1-16(2,3)23-15(22)20-13(14(21)19-9-8-18)10-11-4-6-12(17)7-5-11/h4-7,13H,9-10H2,1-3H3,(H,19,21)(H,20,22)/t13-/m0/s1
Reactome pathway
640n/an/an/an/an/an/an/an/a
Rheinische Friedrich-Wilhelms-Universitat Bonn
Assay Description
Enzyme activities were calculated from kinetic measurements performed by fluorimetric detection of the product AMC at the wavelengths for excitation ...
J Med Chem 48: 7688-707 (2005)
Article DOI: 10.1021/jm050686b
BindingDB Entry DOI: 10.7270/Q2GB22BG
Cathepsin K
(Homo sapiens (Human))
BDBM20103
(dipeptide-derived nitrile, 24 | tert-butyl N-[(1S)...)
Show SMILES CC(C)(C)OC(=O)N[C@@H](Cc1ccc(F)cc1)C(=O)NCC#N |r|
Show InChI InChI=1S/C16H20FN3O3/c1-16(2,3)23-15(22)20-13(14(21)19-9-8-18)10-11-4-6-12(17)7-5-11/h4-7,13H,9-10H2,1-3H3,(H,19,21)(H,20,22)/t13-/m0/s1
Reactome pathway
1.30E+4n/an/an/an/an/an/an/an/a
Rheinische Friedrich-Wilhelms-Universitat Bonn
Assay Description
Enzyme activities were calculated from kinetic measurements performed by fluorimetric detection of the product AMC at the wavelengths for excitation ...
J Med Chem 48: 7688-707 (2005)
Article DOI: 10.1021/jm050686b
BindingDB Entry DOI: 10.7270/Q2GB22BG