BDBM201041 US9233953, 2
SMILES: Fc1cccc([C@@H]2CN(CCN2C(=O)C2CCS(=O)(=O)CC2)c2ncc(cn2)C(F)(F)F)c1F
InChI Key: InChIKey=LECHIXBMMWVSBC-KRWDZBQOSA-N
Data: 1 IC50
Activity Spreadsheet -- Enzyme Inhibition Constant Data from BindingDB
Found 1 hit for monomerid = 201041
Trg + Lig
Ki
nM
ΔG°
kcal/mole
IC50
nM
Kd
nM
EC50/IC50
nM
koff
s-1
kon
M-1s-1
pHTemp
°C
Glycine transporter 1
(Homo sapiens (Human))
BDBM201041
(US9233953, 2)
Show SMILES Fc1cccc([C@@H]2CN(CCN2C(=O)C2CCS(=O)(=O)CC2)c2ncc(cn2)C(F)(F)F)c1F |r|
Show InChI InChI=1S/C21H21F5N4O3S/c22-16-3-1-2-15(18(16)23)17-12-29(20-27-10-14(11-28-20)21(24,25)26)6-7-30(17)19(31)13-4-8-34(32,33)9-5-13/h1-3,10-11,13,17H,4-9,12H2/t17-/m0/s1
US Patent
n/an/a 5n/an/an/an/an/an/a
Boehringer Ingelheim International GmbH
US Patent
Assay Description
Cells expressing either endogenously the GlyT1 transporter like JAR cells (human placental choriocarcinoma cells; e.g. WO 2008/002583) or SK-N-MC cel...
US Patent US9233953 (2016)
BindingDB Entry DOI: 10.7270/Q2Q81BVM