BDBM201090 US9233953, 51
SMILES: Fc1ccc(cc1)[C@@H]1CN(CCN1C(=O)C1CCS(=O)(=O)CC1)c1cc(on1)C(F)(F)F
InChI Key: InChIKey=YJCNKBVYLICZDT-INIZCTEOSA-N
Data: 1 IC50
Activity Spreadsheet -- Enzyme Inhibition Constant Data from BindingDB
Found 1 hit for monomerid = 201090
Trg + Lig
Ki
nM
ΔG°
kcal/mole
IC50
nM
Kd
nM
EC50/IC50
nM
koff
s-1
kon
M-1s-1
pHTemp
°C
Sodium- and chloride-dependent glycine transporter 1
(Homo sapiens (Human))
BDBM201090
(US9233953, 51)
Show SMILES Fc1ccc(cc1)[C@@H]1CN(CCN1C(=O)C1CCS(=O)(=O)CC1)c1cc(on1)C(F)(F)F |r|
Show InChI InChI=1S/C20H21F4N3O4S/c21-15-3-1-13(2-4-15)16-12-26(18-11-17(31-25-18)20(22,23)24)7-8-27(16)19(28)14-5-9-32(29,30)10-6-14/h1-4,11,14,16H,5-10,12H2/t16-/m0/s1
US Patent
n/an/a 1n/an/an/an/an/an/a
Boehringer Ingelheim International GmbH
US Patent
Assay Description
Cells expressing either endogenously the GlyT1 transporter like JAR cells (human placental choriocarcinoma cells; e.g. WO 2008/002583) or SK-N-MC cel...
US Patent US9233953 (2016)
BindingDB Entry DOI: 10.7270/Q2Q81BVM