BDBM201152 US9233953, 113
SMILES: Fc1ccc(cc1)C1CN(CCN1C(=O)C1CCS(=O)(=O)CC1)c1noc(n1)C(F)(F)F
InChI Key: InChIKey=IPFCLBTWYVMYLR-UHFFFAOYSA-N
Data: 1 IC50
Activity Spreadsheet -- Enzyme Inhibition Constant Data from BindingDB
Found 1 hit for monomerid = 201152
Trg + Lig
Ki
nM
ΔG°
kcal/mole
IC50
nM
Kd
nM
EC50/IC50
nM
koff
s-1
kon
M-1s-1
pHTemp
°C
Glycine transporter 1
(Homo sapiens (Human))
BDBM201152
(US9233953, 113)
Show SMILES Fc1ccc(cc1)C1CN(CCN1C(=O)C1CCS(=O)(=O)CC1)c1noc(n1)C(F)(F)F
Show InChI InChI=1S/C19H20F4N4O4S/c20-14-3-1-12(2-4-14)15-11-26(18-24-17(31-25-18)19(21,22)23)7-8-27(15)16(28)13-5-9-32(29,30)10-6-13/h1-4,13,15H,5-11H2
US Patent
n/an/a 9n/an/an/an/an/an/a
Boehringer Ingelheim International GmbH
US Patent
Assay Description
Cells expressing either endogenously the GlyT1 transporter like JAR cells (human placental choriocarcinoma cells; e.g. WO 2008/002583) or SK-N-MC cel...
US Patent US9233953 (2016)
BindingDB Entry DOI: 10.7270/Q2Q81BVM