BDBM201186 US9233953, 148
SMILES: FC(F)(F)c1nnc(s1)N1CCN([C@@H](C1)c1ccc(Cl)s1)C(=O)C1CCS(=O)(=O)CC1
InChI Key: InChIKey=IWIXLRADGYDPKJ-NSHDSACASA-N
Data: 1 IC50
Activity Spreadsheet -- Enzyme Inhibition Constant Data from BindingDB
Found 1 hit for monomerid = 201186
Trg + Lig
Ki
nM
ΔG°
kcal/mole
IC50
nM
Kd
nM
EC50/IC50
nM
koff
s-1
kon
M-1s-1
pHTemp
°C
Glycine transporter 1
(Homo sapiens (Human))
BDBM201186
(US9233953, 148)
Show SMILES FC(F)(F)c1nnc(s1)N1CCN([C@@H](C1)c1ccc(Cl)s1)C(=O)C1CCS(=O)(=O)CC1 |r|
Show InChI InChI=1S/C17H18ClF3N4O3S3/c18-13-2-1-12(29-13)11-9-24(16-23-22-15(30-16)17(19,20)21)5-6-25(11)14(26)10-3-7-31(27,28)8-4-10/h1-2,10-11H,3-9H2/t11-/m0/s1
US Patent
n/an/a 1n/an/an/an/an/an/a
Boehringer Ingelheim International GmbH
US Patent
Assay Description
Cells expressing either endogenously the GlyT1 transporter like JAR cells (human placental choriocarcinoma cells; e.g. WO 2008/002583) or SK-N-MC cel...
US Patent US9233953 (2016)
BindingDB Entry DOI: 10.7270/Q2Q81BVM