BDBM201401 US9187424, 167
SMILES: FC(F)Oc1ccc(cc1)C1=C(NC(=O)c2ccno2)C(=O)NC(C1)(c1ccc(OCCCC(F)(F)F)cc1)C(F)(F)F
InChI Key: InChIKey=VHZACUWGFFQUQN-UHFFFAOYSA-N
Data: 2 IC50
Activity Spreadsheet -- Enzyme Inhibition Constant Data from BindingDB
Found 2 hits for monomerid = 201401
Trg + Lig
Ki
nM
ΔG°
kcal/mole
IC50
nM
Kd
nM
EC50/IC50
nM
koff
s-1
kon
M-1s-1
pHTemp
°C
Alpha-1,6-mannosyl-glycoprotein 2-beta-N-acetylglucosaminyltransferase
(Homo sapiens (Human))
BDBM201401
(US9187424, 167)
Show SMILES FC(F)Oc1ccc(cc1)C1=C(NC(=O)c2ccno2)C(=O)NC(C1)(c1ccc(OCCCC(F)(F)F)cc1)C(F)(F)F |c:11|
Show InChI InChI=1S/C27H21F8N3O5/c28-24(29)42-18-6-2-15(3-7-18)19-14-25(27(33,34)35,38-23(40)21(19)37-22(39)20-10-12-36-43-20)16-4-8-17(9-5-16)41-13-1-11-26(30,31)32/h2-10,12,24H,1,11,13-14H2,(H,37,39)(H,38,40)
US Patent
n/an/a 8n/an/an/an/a7.425
Bristol-Myers Squibb Company
US Patent
Assay Description
MGAT2 enzyme was assayed using membranes isolated from Sf9 cells expressing the recombinant human MGAT2 cDNA with 2-monooleoylglycerol and [3H]-oleoy...
US Patent US9187424 (2015)
BindingDB Entry DOI: 10.7270/Q2FQ9VFG
Alpha-1,6-mannosyl-glycoprotein 2-beta-N-acetylglucosaminyltransferase
(Homo sapiens (Human))
BDBM201401
(US9187424, 167)
Show SMILES FC(F)Oc1ccc(cc1)C1=C(NC(=O)c2ccno2)C(=O)NC(C1)(c1ccc(OCCCC(F)(F)F)cc1)C(F)(F)F |c:11|
Show InChI InChI=1S/C27H21F8N3O5/c28-24(29)42-18-6-2-15(3-7-18)19-14-25(27(33,34)35,38-23(40)21(19)37-22(39)20-10-12-36-43-20)16-4-8-17(9-5-16)41-13-1-11-26(30,31)32/h2-10,12,24H,1,11,13-14H2,(H,37,39)(H,38,40)
US Patent
n/an/a 2n/an/an/an/a7.4n/a
Bristol-Myers Squibb Company
US Patent
Assay Description
The MGAT enzyme reactions were performed in CORNING Falcon 96-well Polypropylene plates, in a total volume of 60 uL of 50 mM Potassium Phosphate buff...
US Patent US9187424 (2015)
BindingDB Entry DOI: 10.7270/Q2FQ9VFG