BDBM20146 2-(2,3-dimethoxyphenyl)-5-(4-fluorophenyl)-3-[(2,4,5-trifluoro-3-methoxyphenyl)carbonyl]-2,3-dihydro-1,3,4-thiadiazole::N-Acylthiadiazoline, 27
SMILES: COc1cccc(C2SC(=NN2C(=O)c2cc(F)c(F)c(OC)c2F)c2ccc(F)cc2)c1OC
InChI Key: InChIKey=HBEVEKLDXZVCSW-UHFFFAOYSA-N
Data: 2 EC50
Activity Spreadsheet -- Enzyme Inhibition Constant Data from BindingDB
Found 2 hits for monomerid = 20146
Trg + Lig
Ki
nM
ΔG°
kcal/mole
IC50
nM
Kd
nM
EC50/IC50
nM
koff
s-1
kon
M-1s-1
pHTemp
°C
Oxysterols receptor LXR-beta
(Homo sapiens (Human))
BDBM20146
(2-(2,3-dimethoxyphenyl)-5-(4-fluorophenyl)-3-[(2,4...)
Show SMILES COc1cccc(C2SC(=NN2C(=O)c2cc(F)c(F)c(OC)c2F)c2ccc(F)cc2)c1OC |c:9|
Show InChI InChI=1S/C24H18F4N2O4S/c1-32-17-6-4-5-14(20(17)33-2)24-30(29-22(35-24)12-7-9-13(25)10-8-12)23(31)15-11-16(26)19(28)21(34-3)18(15)27/h4-11,24H,1-3H3
n/an/an/an/a 81n/an/an/an/a
GNF
Assay Description
FRET-based co-activator recruitment assay measures agonist activities in a 384-well plate format. Reaction mixture containing His-tagged hLXR, biotin...
J Med Chem 50: 4255-9 (2007)
Article DOI: 10.1021/jm070453f
BindingDB Entry DOI: 10.7270/Q2BK19N6
Oxysterols receptor LXR-alpha
(Homo sapiens (Human))
BDBM20146
(2-(2,3-dimethoxyphenyl)-5-(4-fluorophenyl)-3-[(2,4...)
Show SMILES COc1cccc(C2SC(=NN2C(=O)c2cc(F)c(F)c(OC)c2F)c2ccc(F)cc2)c1OC |c:9|
Show InChI InChI=1S/C24H18F4N2O4S/c1-32-17-6-4-5-14(20(17)33-2)24-30(29-22(35-24)12-7-9-13(25)10-8-12)23(31)15-11-16(26)19(28)21(34-3)18(15)27/h4-11,24H,1-3H3
NCI pathway
Reactome pathway
n/an/an/an/a 700n/an/a7.237
GNF
Assay Description
FRET-based co-activator recruitment assay measures agonist activities in a 384-well plate format. Reaction mixture containing His-tagged hLXR, biotin...
J Med Chem 50: 4255-9 (2007)
Article DOI: 10.1021/jm070453f
BindingDB Entry DOI: 10.7270/Q2BK19N6