BDBM20150 5-(4-fluorophenyl)-2-(2-methoxyphenyl)-2-methyl-3-[(2,4,6-trifluorophenyl)carbonyl]-2,3-dihydro-1,3,4-thiadiazole::N-Acylthiadiazoline, 15
SMILES: COc1ccccc1C1(C)SC(=NN1C(=O)c1c(F)cc(F)cc1F)c1ccc(F)cc1
InChI Key: InChIKey=QXTOGDQRXCPBNC-UHFFFAOYSA-N
Data: 1 EC50
Activity Spreadsheet -- Enzyme Inhibition Constant Data from BindingDB
Found 1 hit for monomerid = 20150
Trg + Lig
Ki
nM
ΔG°
kcal/mole
IC50
nM
Kd
nM
EC50/IC50
nM
koff
s-1
kon
M-1s-1
pHTemp
°C
Oxysterols receptor LXR-beta
(Homo sapiens (Human))
BDBM20150
(5-(4-fluorophenyl)-2-(2-methoxyphenyl)-2-methyl-3-...)
Show SMILES COc1ccccc1C1(C)SC(=NN1C(=O)c1c(F)cc(F)cc1F)c1ccc(F)cc1 |c:12|
Show InChI InChI=1S/C23H16F4N2O2S/c1-23(16-5-3-4-6-19(16)31-2)29(22(30)20-17(26)11-15(25)12-18(20)27)28-21(32-23)13-7-9-14(24)10-8-13/h3-12H,1-2H3
n/an/an/an/a 4.00E+3n/an/an/an/a
GNF
Assay Description
FRET-based co-activator recruitment assay measures agonist activities in a 384-well plate format. Reaction mixture containing His-tagged hLXR, biotin...
J Med Chem 50: 4255-9 (2007)
Article DOI: 10.1021/jm070453f
BindingDB Entry DOI: 10.7270/Q2BK19N6