BDBM201531 US9187424, 298
SMILES: CCCCCCC#CC1(CC(=C(NC(=O)CNS(C)(=O)=O)C(=O)N1)c1ccc(C)cc1)C(F)(F)F
InChI Key: InChIKey=XFAAVSFTQPYISV-UHFFFAOYSA-N
Data: 1 IC50
Activity Spreadsheet -- Enzyme Inhibition Constant Data from BindingDB
Found 1 hit for monomerid = 201531
Trg + Lig
Ki
nM
ΔG°
kcal/mole
IC50
nM
Kd
nM
EC50/IC50
nM
koff
s-1
kon
M-1s-1
pHTemp
°C
Alpha-1,6-mannosyl-glycoprotein 2-beta-N-acetylglucosaminyltransferase
(Homo sapiens (Human))
BDBM201531
(US9187424, 298)
Show SMILES CCCCCCC#CC1(CC(=C(NC(=O)CNS(C)(=O)=O)C(=O)N1)c1ccc(C)cc1)C(F)(F)F |t:10|
Show InChI InChI=1S/C24H30F3N3O4S/c1-4-5-6-7-8-9-14-23(24(25,26)27)15-19(18-12-10-17(2)11-13-18)21(22(32)30-23)29-20(31)16-28-35(3,33)34/h10-13,28H,4-8,15-16H2,1-3H3,(H,29,31)(H,30,32)
US Patent
n/an/a 2n/an/an/an/a7.4n/a
Bristol-Myers Squibb Company
US Patent
Assay Description
The MGAT enzyme reactions were performed in CORNING Falcon 96-well Polypropylene plates, in a total volume of 60 uL of 50 mM Potassium Phosphate buff...
US Patent US9187424 (2015)
BindingDB Entry DOI: 10.7270/Q2FQ9VFG