BDBM20154 3-[(3-chlorophenyl)carbonyl]-2-(2,3-dimethoxyphenyl)-5-(4-fluorophenyl)-2,3-dihydro-1,3,4-thiadiazole::N-Acylthiadiazoline, 23
SMILES: COc1cccc(C2SC(=NN2C(=O)c2cccc(Cl)c2)c2ccc(F)cc2)c1OC
InChI Key: InChIKey=KDDWANWSZBFGNC-UHFFFAOYSA-N
Data: 1 EC50
Activity Spreadsheet -- Enzyme Inhibition Constant Data from BindingDB
Found 1 hit for monomerid = 20154
Trg + Lig
Ki
nM
ΔG°
kcal/mole
IC50
nM
Kd
nM
EC50/IC50
nM
koff
s-1
kon
M-1s-1
pHTemp
°C
Oxysterols receptor LXR-beta
(Homo sapiens (Human))
BDBM20154
(3-[(3-chlorophenyl)carbonyl]-2-(2,3-dimethoxypheny...)
Show SMILES COc1cccc(C2SC(=NN2C(=O)c2cccc(Cl)c2)c2ccc(F)cc2)c1OC |c:9|
Show InChI InChI=1S/C23H18ClFN2O3S/c1-29-19-8-4-7-18(20(19)30-2)23-27(22(28)15-5-3-6-16(24)13-15)26-21(31-23)14-9-11-17(25)12-10-14/h3-13,23H,1-2H3
n/an/an/an/a 250n/an/an/an/a
GNF
Assay Description
FRET-based co-activator recruitment assay measures agonist activities in a 384-well plate format. Reaction mixture containing His-tagged hLXR, biotin...
J Med Chem 50: 4255-9 (2007)
Article DOI: 10.1021/jm070453f
BindingDB Entry DOI: 10.7270/Q2BK19N6