BDBM201679 US9233979, 107
SMILES: Cc1nc(NC(=O)N[C@@H](c2ccccc2)C(C)(C)O)cc2[nH]nc(N3CCOCC3)c12
InChI Key:
Data: 1 IC50
Activity Spreadsheet -- Enzyme Inhibition Constant Data from BindingDB
Found 1 hit for monomerid = 201679
Trg + Lig
Ki
nM
ΔG°
kcal/mole
IC50
nM
Kd
nM
EC50/IC50
nM
koff
s-1
kon
M-1s-1
pHTemp
°C
Mitogen-activated protein kinase 1
(Homo sapiens (Human))
BDBM201679
(US9233979, 107)
Show SMILES Cc1nc(NC(=O)N[C@@H](c2ccccc2)C(C)(C)O)cc2[nH]nc(N3CCOCC3)c12 |r|
NCI pathway
Reactome pathway
US Patent
n/an/a 0.300n/an/an/an/an/an/a
Merck Sharp & Dohme Corp.
US Patent
Assay Description
Activated ERK2 activity was determined in an IMAP-FP assay (Molecular Devices). Using this assay format, the potency (IC50) of each compound was de...
US Patent US9233979 (2016)
BindingDB Entry DOI: 10.7270/Q2B27T3B