null
SMILES: CN1CCOC(C1)c1ccc(cc1)-c1cc2c(ccnc2[nH]1)-c1cccc(N2CCOc3cc(ccc3C2=O)C2CC2)c1CO
InChI Key:
Activity Spreadsheet -- Enzyme Inhibition Constant Data from BindingDB
Found 1 hit for monomerid = 202108
Trg + Lig
Ki
nM
ΔG°
kcal/mole
IC50
nM
Kd
nM
EC50/IC50
nM
koff
s-1
kon
M-1s-1
pHTemp
°C
Tyrosine-protein kinase BTK
(Homo sapiens (Human))
BDBM202108
(US9233983, C-5)
Show SMILES CN1CCOC(C1)c1ccc(cc1)-c1cc2c(ccnc2[nH]1)-c1cccc(N2CCOc3cc(ccc3C2=O)C2CC2)c1CO
NCI pathway
Reactome pathway
US Patent
n/an/a 3n/an/an/an/an/an/a
ADVINUS THERAPEUTICS LIMITED
US Patent
Assay Description
The inhibition assays were performed using the generic tyrosine kinase assay kit from C is Bio (HTRF KinEASE-TK #62TK0PEB). The assay is based on t...
US Patent US9233983 (2016)
BindingDB Entry DOI: 10.7270/Q22J69PQ