null
SMILES: CN1CC(C1)N1CCC(=CC1)c1cc2c(ccnc2[nH]1)-c1cccc(N2CCOc3cc(cc(F)c3C2=O)C2CC2)c1CO
InChI Key: InChIKey=AQYSJGQDGZJWHD-UHFFFAOYSA-N
Activity Spreadsheet -- Enzyme Inhibition Constant Data from BindingDB
Found 1 hit for monomerid = 202225
Trg + Lig
Ki
nM
ΔG°
kcal/mole
IC50
nM
Kd
nM
EC50/IC50
nM
koff
s-1
kon
M-1s-1
pHTemp
°C
Tyrosine-protein kinase BTK
(Homo sapiens (Human))
BDBM202225
(US9233983, R-4)
Show SMILES CN1CC(C1)N1CCC(=CC1)c1cc2c(ccnc2[nH]1)-c1cccc(N2CCOc3cc(cc(F)c3C2=O)C2CC2)c1CO |c:9|
Show InChI InChI=1S/C35H36FN5O3/c1-39-18-24(19-39)40-11-8-22(9-12-40)30-17-27-26(7-10-37-34(27)38-30)25-3-2-4-31(28(25)20-42)41-13-14-44-32-16-23(21-5-6-21)15-29(36)33(32)35(41)43/h2-4,7-8,10,15-17,21,24,42H,5-6,9,11-14,18-20H2,1H3,(H,37,38)
NCI pathway
Reactome pathway
US Patent
n/an/a 1.60n/an/an/an/an/an/a
ADVINUS THERAPEUTICS LIMITED
US Patent
Assay Description
The inhibition assays were performed using the generic tyrosine kinase assay kit from C is Bio (HTRF KinEASE-TK #62TK0PEB). The assay is based on t...
US Patent US9233983 (2016)
BindingDB Entry DOI: 10.7270/Q22J69PQ