BDBM202362 US9238626, (+/-)-(Ia) HCl
SMILES: CC1=CC2CC(C1)c1c(C2)nc2cc(Cl)ccc2c1NCCCCCCCCNC(=O)c1cc(O)c2C(=O)c3c(O)cccc3C(=O)c2c1
InChI Key: InChIKey=SRHFLJYMGNBGDH-UHFFFAOYSA-N
Data: 4 IC50
Activity Spreadsheet -- Enzyme Inhibition Constant Data from BindingDB
Found 4 hits for monomerid = 202362
Trg + Lig
Ki
nM
ΔG°
kcal/mole
IC50
nM
Kd
nM
EC50/IC50
nM
koff
s-1
kon
M-1s-1
pHTemp
°C
Cholinesterase
(Homo sapiens (Human))
BDBM202362
(US9238626, (+/-)-(Ia) HCl)
Show SMILES CC1=CC2CC(C1)c1c(C2)nc2cc(Cl)ccc2c1NCCCCCCCCNC(=O)c1cc(O)c2C(=O)c3c(O)cccc3C(=O)c2c1 |t:1|
Show InChI InChI=1S/C40H40ClN3O5/c1-22-15-23-17-24(16-22)34-31(18-23)44-30-21-26(41)11-12-27(30)37(34)42-13-6-4-2-3-5-7-14-43-40(49)25-19-29-36(33(46)20-25)39(48)35-28(38(29)47)9-8-10-32(35)45/h8-12,15,19-21,23-24,45-46H,2-7,13-14,16-18H2,1H3,(H,42,44)(H,43,49)
Reactome pathway
US Patent
n/an/a 350n/an/an/an/a8.025
UNIVERSITAT DE BARCELONA; PONTIFICIA UNIVERSIDAD CATÓLICA DE CHILE
US Patent
Assay Description
BChE inhibitory activity determinations were carried out similarly by the method of Ellman et al., using 0.02 unit/mL of human serum BChE and 300 u...
US Patent US9238626 (2016)
BindingDB Entry DOI: 10.7270/Q2T152FZ
Acetylcholinesterase
(Homo sapiens (Human))
BDBM202362
(US9238626, (+/-)-(Ia) HCl)
Show SMILES CC1=CC2CC(C1)c1c(C2)nc2cc(Cl)ccc2c1NCCCCCCCCNC(=O)c1cc(O)c2C(=O)c3c(O)cccc3C(=O)c2c1 |t:1|
Show InChI InChI=1S/C40H40ClN3O5/c1-22-15-23-17-24(16-22)34-31(18-23)44-30-21-26(41)11-12-27(30)37(34)42-13-6-4-2-3-5-7-14-43-40(49)25-19-29-36(33(46)20-25)39(48)35-28(38(29)47)9-8-10-32(35)45/h8-12,15,19-21,23-24,45-46H,2-7,13-14,16-18H2,1H3,(H,42,44)(H,43,49)
NCI pathway
Reactome pathway
US Patent
n/an/a 4.40n/an/an/an/a8.025
UNIVERSITAT DE BARCELONA; PONTIFICIA UNIVERSIDAD CATÓLICA DE CHILE
US Patent
Assay Description
AChE inhibitory activity of compounds (Ia)-(Ie) and (-)-(Ib) and (+)-(Ib) was evaluated spectrophotometrically at 25° C. by the method of Ellma...
US Patent US9238626 (2016)
BindingDB Entry DOI: 10.7270/Q2T152FZ
Acetylcholinesterase
(Electrophorus electricus (Electric eel))
BDBM202362
(US9238626, (+/-)-(Ia) HCl)
Show SMILES CC1=CC2CC(C1)c1c(C2)nc2cc(Cl)ccc2c1NCCCCCCCCNC(=O)c1cc(O)c2C(=O)c3c(O)cccc3C(=O)c2c1 |t:1|
Show InChI InChI=1S/C40H40ClN3O5/c1-22-15-23-17-24(16-22)34-31(18-23)44-30-21-26(41)11-12-27(30)37(34)42-13-6-4-2-3-5-7-14-43-40(49)25-19-29-36(33(46)20-25)39(48)35-28(38(29)47)9-8-10-32(35)45/h8-12,15,19-21,23-24,45-46H,2-7,13-14,16-18H2,1H3,(H,42,44)(H,43,49)
US Patent
n/an/a 88.6n/an/an/an/a8.025
UNIVERSITAT DE BARCELONA; PONTIFICIA UNIVERSIDAD CATÓLICA DE CHILE
US Patent
Assay Description
AChE inhibitory activity of compounds (Ia)-(Ie) and (-)-(Ib) and (+)-(Ib) was evaluated spectrophotometrically at 25° C. by the method of Ellma...
US Patent US9238626 (2016)
BindingDB Entry DOI: 10.7270/Q2T152FZ
Beta-secretase 1
(Homo sapiens (Human))
BDBM202362
(US9238626, (+/-)-(Ia) HCl)
Show SMILES CC1=CC2CC(C1)c1c(C2)nc2cc(Cl)ccc2c1NCCCCCCCCNC(=O)c1cc(O)c2C(=O)c3c(O)cccc3C(=O)c2c1 |t:1|
Show InChI InChI=1S/C40H40ClN3O5/c1-22-15-23-17-24(16-22)34-31(18-23)44-30-21-26(41)11-12-27(30)37(34)42-13-6-4-2-3-5-7-14-43-40(49)25-19-29-36(33(46)20-25)39(48)35-28(38(29)47)9-8-10-32(35)45/h8-12,15,19-21,23-24,45-46H,2-7,13-14,16-18H2,1H3,(H,42,44)(H,43,49)
US Patent
n/an/a 980n/an/an/an/an/a25
UNIVERSITAT DE BARCELONA; PONTIFICIA UNIVERSIDAD CATÓLICA DE CHILE
US Patent
Assay Description
β-Secretase (BACE-1, Sigma) inhibition studies were performed by employing a peptide mimicking APP sequence as substrate (methoxycoumarin-Ser-...
US Patent US9238626 (2016)
BindingDB Entry DOI: 10.7270/Q2T152FZ