null
SMILES: CCN1c2nc(Cl)ccc2N(C)C(=O)c2cc(COc3ccccc3)cnc12
InChI Key: InChIKey=LOWZYNIZJZKVGV-UHFFFAOYSA-N
Activity Spreadsheet -- Enzyme Inhibition Constant Data from BindingDB
Found 4 hits for monomerid = 2025
Trg + Lig
Ki
nM
ΔG°
kcal/mole
IC50
nM
Kd
nM
EC50/IC50
nM
koff
s-1
kon
M-1s-1
pHTemp
°C
Gag-Pol polyprotein [600-1027,R876K]/[600-1155]
(Human immunodeficiency virus type 1)
BDBM2025
(2,8-disubstituted dipyridodiazepinone 4 | 2-Chloro...)
Show SMILES CCN1c2nc(Cl)ccc2N(C)C(=O)c2cc(COc3ccccc3)cnc12
Show InChI InChI=1S/C21H19ClN4O2/c1-3-26-19-16(21(27)25(2)17-9-10-18(22)24-20(17)26)11-14(12-23-19)13-28-15-7-5-4-6-8-15/h4-12H,3,13H2,1-2H3
n/an/a 110n/an/an/an/a7.822
Boehringer Ingelheim Pharmaceuticals Inc.
Assay Description
The IC50 of reverse transcriptase is the concentration that inhibits 50% of recombinant HIV-1 RT RNA-directed DNA polymerase activity in vitro.
J Med Chem 41: 2972-84 (1998)
Article DOI: 10.1021/jm9707030
BindingDB Entry DOI: 10.7270/Q2J964K7
Reverse transcriptase/RNaseH
(Human immunodeficiency virus 1)
BDBM2025
(2,8-disubstituted dipyridodiazepinone 4 | 2-Chloro...)
Show SMILES CCN1c2nc(Cl)ccc2N(C)C(=O)c2cc(COc3ccccc3)cnc12
Show InChI InChI=1S/C21H19ClN4O2/c1-3-26-19-16(21(27)25(2)17-9-10-18(22)24-20(17)26)11-14(12-23-19)13-28-15-7-5-4-6-8-15/h4-12H,3,13H2,1-2H3
n/an/a 110n/an/an/an/an/an/a
Boehringer Ingelheim Pharmaceuticals Inc.
Assay Description
Inhibitory activity against HIV-1 wild-type reverse transcriptase.
J Med Chem 41: 2972-84 (1998)
Article DOI: 10.1021/jm9707030
BindingDB Entry DOI: 10.7270/Q2J964K7
Gag-Pol polyprotein [600-1027,Y787L]/[600-1155,Y787L]
(Human immunodeficiency virus type 1)
BDBM2025
(2,8-disubstituted dipyridodiazepinone 4 | 2-Chloro...)
Show SMILES CCN1c2nc(Cl)ccc2N(C)C(=O)c2cc(COc3ccccc3)cnc12
Show InChI InChI=1S/C21H19ClN4O2/c1-3-26-19-16(21(27)25(2)17-9-10-18(22)24-20(17)26)11-14(12-23-19)13-28-15-7-5-4-6-8-15/h4-12H,3,13H2,1-2H3
n/an/a 640n/an/an/an/a7.822
Boehringer Ingelheim Pharmaceuticals Inc.
Assay Description
The IC50 of reverse transcriptase is the concentration that inhibits 50% of recombinant HIV-1 RT RNA-directed DNA polymerase activity in vitro.
J Med Chem 41: 2972-84 (1998)
Article DOI: 10.1021/jm9707030
BindingDB Entry DOI: 10.7270/Q2J964K7
Gag-Pol polyprotein [600-1027,Y780C]/[600-1155,Y780C]
(Human immunodeficiency virus type 1)
BDBM2025
(2,8-disubstituted dipyridodiazepinone 4 | 2-Chloro...)
Show SMILES CCN1c2nc(Cl)ccc2N(C)C(=O)c2cc(COc3ccccc3)cnc12
Show InChI InChI=1S/C21H19ClN4O2/c1-3-26-19-16(21(27)25(2)17-9-10-18(22)24-20(17)26)11-14(12-23-19)13-28-15-7-5-4-6-8-15/h4-12H,3,13H2,1-2H3
n/an/a 60n/an/an/an/a7.822
Boehringer Ingelheim Pharmaceuticals Inc.
Assay Description
The IC50 of reverse transcriptase is the concentration that inhibits 50% of recombinant HIV-1 RT RNA-directed DNA polymerase activity in vitro.
J Med Chem 41: 2972-84 (1998)
Article DOI: 10.1021/jm9707030
BindingDB Entry DOI: 10.7270/Q2J964K7