BDBM202553 (E/Z)-2-cyano-3-(5-(1-cyclohexyl-1,6-dihydroimidazo[4,5-d]pyrrolo[2,3-b]pyridin-2-yl)furan-2-yl)-N,N-dimethylacrylamide (4)
SMILES: CN(C)C(=O)C(=C\c1ccc(o1)-c1nc2cnc3[nH]ccc3c2n1C1CCCCC1)\C#N
InChI Key: InChIKey=GJMZWYLOARVASY-NTCAYCPXSA-N
Data: 5 IC50  4 Kd
Activity Spreadsheet -- Enzyme Inhibition Constant Data from BindingDB
Found 9 hits for monomerid = 202553
Trg + Lig
Ki
nM
ΔG°
kcal/mole
IC50
nM
Kd
nM
EC50/IC50
nM
koff
s-1
kon
M-1s-1
pHTemp
°C
JAK3 (aa 781-1124)
(Homo sapiens (Human))
BDBM202553
((E/Z)-2-cyano-3-(5-(1-cyclohexyl-1,6-dihydroimidaz...)
Show SMILES CN(C)C(=O)C(=C\c1ccc(o1)-c1nc2cnc3[nH]ccc3c2n1C1CCCCC1)\C#N
Show InChI InChI=1S/C24H24N6O2/c1-29(2)24(31)15(13-25)12-17-8-9-20(32-17)23-28-19-14-27-22-18(10-11-26-22)21(19)30(23)16-6-4-3-5-7-16/h8-12,14,16H,3-7H2,1-2H3,(H,26,27)/b15-12+
n/an/a 9n/an/an/an/an/an/a
Eberhard-Karls-University Tuebingen
Assay Description
In this ELISA-based kinase activity assay, a 96-well assay plate is coated with an artificial polypeptide serving as kinase substrate that contains t...
Cell Chem Biol 23: 1335-1340 (2016)
Article DOI: 10.1016/j.chembiol.2016.10.008
BindingDB Entry DOI: 10.7270/Q2WS8S22
Tyrosine-protein kinase JAK1
(Homo sapiens (Human))
BDBM202553
((E/Z)-2-cyano-3-(5-(1-cyclohexyl-1,6-dihydroimidaz...)
Show SMILES CN(C)C(=O)C(=C\c1ccc(o1)-c1nc2cnc3[nH]ccc3c2n1C1CCCCC1)\C#N
Show InChI InChI=1S/C24H24N6O2/c1-29(2)24(31)15(13-25)12-17-8-9-20(32-17)23-28-19-14-27-22-18(10-11-26-22)21(19)30(23)16-6-4-3-5-7-16/h8-12,14,16H,3-7H2,1-2H3,(H,26,27)/b15-12+
Reactome pathway
n/an/a 52n/an/an/an/an/an/a
Eberhard-Karls-University Tuebingen
Assay Description
A commercial assay by Reaction Biology Corp.
Cell Chem Biol 23: 1335-1340 (2016)
Article DOI: 10.1016/j.chembiol.2016.10.008
BindingDB Entry DOI: 10.7270/Q2WS8S22
Tyrosine-protein kinase JAK2
(Homo sapiens (Human))
BDBM202553
((E/Z)-2-cyano-3-(5-(1-cyclohexyl-1,6-dihydroimidaz...)
Show SMILES CN(C)C(=O)C(=C\c1ccc(o1)-c1nc2cnc3[nH]ccc3c2n1C1CCCCC1)\C#N
Show InChI InChI=1S/C24H24N6O2/c1-29(2)24(31)15(13-25)12-17-8-9-20(32-17)23-28-19-14-27-22-18(10-11-26-22)21(19)30(23)16-6-4-3-5-7-16/h8-12,14,16H,3-7H2,1-2H3,(H,26,27)/b15-12+
Reactome pathway
n/an/a 346n/an/an/an/an/an/a
Eberhard-Karls-University Tuebingen
Assay Description
A commercial assay by Reaction Biology Corp.
Cell Chem Biol 23: 1335-1340 (2016)
Article DOI: 10.1016/j.chembiol.2016.10.008
BindingDB Entry DOI: 10.7270/Q2WS8S22
Tyrosine-protein kinase JAK3
(Homo sapiens (Human))
BDBM202553
((E/Z)-2-cyano-3-(5-(1-cyclohexyl-1,6-dihydroimidaz...)
Show SMILES CN(C)C(=O)C(=C\c1ccc(o1)-c1nc2cnc3[nH]ccc3c2n1C1CCCCC1)\C#N
Show InChI InChI=1S/C24H24N6O2/c1-29(2)24(31)15(13-25)12-17-8-9-20(32-17)23-28-19-14-27-22-18(10-11-26-22)21(19)30(23)16-6-4-3-5-7-16/h8-12,14,16H,3-7H2,1-2H3,(H,26,27)/b15-12+
Reactome pathway
n/an/a 0.127n/an/an/an/an/an/a
Eberhard-Karls-University Tuebingen
Assay Description
A commercial assay by Reaction Biology Corp.
Cell Chem Biol 23: 1335-1340 (2016)
Article DOI: 10.1016/j.chembiol.2016.10.008
BindingDB Entry DOI: 10.7270/Q2WS8S22
Non-receptor tyrosine-protein kinase TYK2
(Homo sapiens (Human))
BDBM202553
((E/Z)-2-cyano-3-(5-(1-cyclohexyl-1,6-dihydroimidaz...)
Show SMILES CN(C)C(=O)C(=C\c1ccc(o1)-c1nc2cnc3[nH]ccc3c2n1C1CCCCC1)\C#N
Show InChI InChI=1S/C24H24N6O2/c1-29(2)24(31)15(13-25)12-17-8-9-20(32-17)23-28-19-14-27-22-18(10-11-26-22)21(19)30(23)16-6-4-3-5-7-16/h8-12,14,16H,3-7H2,1-2H3,(H,26,27)/b15-12+
n/an/an/a 360n/an/an/an/an/a
Eberhard-Karls-University Tuebingen
Assay Description
The assay is based on the displacement of a reporter probe by a test compound. Close proximity of the probe and the targeted kinase result in emissio...
Cell Chem Biol 23: 1335-1340 (2016)
Article DOI: 10.1016/j.chembiol.2016.10.008
BindingDB Entry DOI: 10.7270/Q2WS8S22
Tyrosine-protein kinase JAK1
(Homo sapiens (Human))
BDBM202553
((E/Z)-2-cyano-3-(5-(1-cyclohexyl-1,6-dihydroimidaz...)
Show SMILES CN(C)C(=O)C(=C\c1ccc(o1)-c1nc2cnc3[nH]ccc3c2n1C1CCCCC1)\C#N
Show InChI InChI=1S/C24H24N6O2/c1-29(2)24(31)15(13-25)12-17-8-9-20(32-17)23-28-19-14-27-22-18(10-11-26-22)21(19)30(23)16-6-4-3-5-7-16/h8-12,14,16H,3-7H2,1-2H3,(H,26,27)/b15-12+
Reactome pathway
n/an/an/a 69.7n/an/an/an/an/a
Eberhard-Karls-University Tuebingen
Assay Description
The assay is based on the displacement of a reporter probe by a test compound. Close proximity of the probe and the targeted kinase result in emissio...
Cell Chem Biol 23: 1335-1340 (2016)
Article DOI: 10.1016/j.chembiol.2016.10.008
BindingDB Entry DOI: 10.7270/Q2WS8S22
Tyrosine-protein kinase JAK2
(Homo sapiens (Human))
BDBM202553
((E/Z)-2-cyano-3-(5-(1-cyclohexyl-1,6-dihydroimidaz...)
Show SMILES CN(C)C(=O)C(=C\c1ccc(o1)-c1nc2cnc3[nH]ccc3c2n1C1CCCCC1)\C#N
Show InChI InChI=1S/C24H24N6O2/c1-29(2)24(31)15(13-25)12-17-8-9-20(32-17)23-28-19-14-27-22-18(10-11-26-22)21(19)30(23)16-6-4-3-5-7-16/h8-12,14,16H,3-7H2,1-2H3,(H,26,27)/b15-12+
Reactome pathway
n/an/an/a 242n/an/an/an/an/a
Eberhard-Karls-University Tuebingen
Assay Description
The assay is based on the displacement of a reporter probe by a test compound. Close proximity of the probe and the targeted kinase result in emissio...
Cell Chem Biol 23: 1335-1340 (2016)
Article DOI: 10.1016/j.chembiol.2016.10.008
BindingDB Entry DOI: 10.7270/Q2WS8S22
Tyrosine-protein kinase JAK3
(Homo sapiens (Human))
BDBM202553
((E/Z)-2-cyano-3-(5-(1-cyclohexyl-1,6-dihydroimidaz...)
Show SMILES CN(C)C(=O)C(=C\c1ccc(o1)-c1nc2cnc3[nH]ccc3c2n1C1CCCCC1)\C#N
Show InChI InChI=1S/C24H24N6O2/c1-29(2)24(31)15(13-25)12-17-8-9-20(32-17)23-28-19-14-27-22-18(10-11-26-22)21(19)30(23)16-6-4-3-5-7-16/h8-12,14,16H,3-7H2,1-2H3,(H,26,27)/b15-12+
Reactome pathway
n/an/an/a 1.34n/an/an/an/an/a
Eberhard-Karls-University Tuebingen
Assay Description
The assay is based on the displacement of a reporter probe by a test compound. Close proximity of the probe and the targeted kinase result in emissio...
Cell Chem Biol 23: 1335-1340 (2016)
Article DOI: 10.1016/j.chembiol.2016.10.008
BindingDB Entry DOI: 10.7270/Q2WS8S22
Non-receptor tyrosine-protein kinase TYK2
(Homo sapiens (Human))
BDBM202553
((E/Z)-2-cyano-3-(5-(1-cyclohexyl-1,6-dihydroimidaz...)
Show SMILES CN(C)C(=O)C(=C\c1ccc(o1)-c1nc2cnc3[nH]ccc3c2n1C1CCCCC1)\C#N
Show InChI InChI=1S/C24H24N6O2/c1-29(2)24(31)15(13-25)12-17-8-9-20(32-17)23-28-19-14-27-22-18(10-11-26-22)21(19)30(23)16-6-4-3-5-7-16/h8-12,14,16H,3-7H2,1-2H3,(H,26,27)/b15-12+
n/an/a 459n/an/an/an/an/an/a
Eberhard-Karls-University Tuebingen
Assay Description
A commercial assay by Reaction Biology Corp.
Cell Chem Biol 23: 1335-1340 (2016)
Article DOI: 10.1016/j.chembiol.2016.10.008
BindingDB Entry DOI: 10.7270/Q2WS8S22