BDBM202617 US9242943, 26
SMILES: C[C@]1(COCC(N)=N1)c1cc(Nc2cccc3cc(Cl)cnc23)ccc1F
InChI Key: InChIKey=QIANIVYIOVZEHV-FQEVSTJZSA-N
Data: 2 IC50
Activity Spreadsheet -- Enzyme Inhibition Constant Data from BindingDB
Found 2 hits for monomerid = 202617
Trg + Lig
Ki
nM
ΔG°
kcal/mole
IC50
nM
Kd
nM
EC50/IC50
nM
koff
s-1
kon
M-1s-1
pHTemp
°C
Beta-secretase 2
(Homo sapiens (Human))
BDBM202617
(US9242943, 26)
Show SMILES C[C@]1(COCC(N)=N1)c1cc(Nc2cccc3cc(Cl)cnc23)ccc1F |r,c:6|
Show InChI InChI=1S/C20H18ClFN4O/c1-20(11-27-10-18(23)26-20)15-8-14(5-6-16(15)22)25-17-4-2-3-12-7-13(21)9-24-19(12)17/h2-9,25H,10-11H2,1H3,(H2,23,26)/t20-/m0/s1
US Patent
n/an/a 77n/an/an/an/an/an/a
SIENA BIOTECH S.P.A.; HOFFMANN-LA ROCHE INC.
US Patent
Assay Description
The assay uses the principle of inhibition of human TMEM27 cleavage by endogenous cellular BACE2 in the Ins1e rat cell line and shedding from the cel...
US Patent US9242943 (2016)
BindingDB Entry DOI: 10.7270/Q2833QV5
Beta-secretase 1
(Homo sapiens (Human))
BDBM202617
(US9242943, 26)
Show SMILES C[C@]1(COCC(N)=N1)c1cc(Nc2cccc3cc(Cl)cnc23)ccc1F |r,c:6|
Show InChI InChI=1S/C20H18ClFN4O/c1-20(11-27-10-18(23)26-20)15-8-14(5-6-16(15)22)25-17-4-2-3-12-7-13(21)9-24-19(12)17/h2-9,25H,10-11H2,1H3,(H2,23,26)/t20-/m0/s1
US Patent
n/an/a 160n/an/an/an/an/an/a
SIENA BIOTECH S.P.A.; HOFFMANN-LA ROCHE INC.
US Patent
Assay Description
DNA of the human APP wt gene (APP695) were used to assess the potency of the compounds in a cellular assay. The cells were seeded in 96-well microtit...
US Patent US9242943 (2016)
BindingDB Entry DOI: 10.7270/Q2833QV5