null
SMILES: Cc1ccc(NC(=O)c2cccc(c2)C(F)(F)F)cc1-c1cc(ccn1)N1CCOCC1
InChI Key: InChIKey=IQQLLSYZIGEGPW-UHFFFAOYSA-N
Activity Spreadsheet -- Enzyme Inhibition Constant Data from BindingDB
Found 10 hits for monomerid = 202718
Trg + Lig
Ki
nM
ΔG°
kcal/mole
IC50
nM
Kd
nM
EC50/IC50
nM
koff
s-1
kon
M-1s-1
pHTemp
°C
RAF proto-oncogene serine/threonine-protein kinase [1-324]
(Homo sapiens (Human))
BDBM202718
(US10245267, Example 111 | US10709712, Example 111 ...)
Show SMILES Cc1ccc(NC(=O)c2cccc(c2)C(F)(F)F)cc1-c1cc(ccn1)N1CCOCC1
Show InChI InChI=1S/C24H22F3N3O2/c1-16-5-6-19(29-23(31)17-3-2-4-18(13-17)24(25,26)27)14-21(16)22-15-20(7-8-28-22)30-9-11-32-12-10-30/h2-8,13-15H,9-12H2,1H3,(H,29,31)
US Patent
n/an/a 0.847n/an/an/an/a7.525
Novartis AG
US Patent
Assay Description
Final assay conditions were 4 pM cRaf, 3 uM ATP, 10 nM biotin tagged MEK1 kinase dead protein substrate. Reactions were performed in Greiner384 well ...
US Patent US9242969 (2016)
BindingDB Entry DOI: 10.7270/Q2VT1QXT
RAF proto-oncogene serine/threonine-protein kinase [1-324]
(Homo sapiens (Human))
BDBM202718
(US10245267, Example 111 | US10709712, Example 111 ...)
Show SMILES Cc1ccc(NC(=O)c2cccc(c2)C(F)(F)F)cc1-c1cc(ccn1)N1CCOCC1
Show InChI InChI=1S/C24H22F3N3O2/c1-16-5-6-19(29-23(31)17-3-2-4-18(13-17)24(25,26)27)14-21(16)22-15-20(7-8-28-22)30-9-11-32-12-10-30/h2-8,13-15H,9-12H2,1H3,(H,29,31)
US Patent
n/an/a 0.400n/an/an/an/a7.525
NOVARTIS AG
US Patent
Assay Description
Raf and biotinylated Mek, kinase dead, were combined at 2x final concentrations in assay buffer (50 mM Tris, pH 7.5, 15 mM MgCl2, 0.01% BSA and 1 mM ...
US Patent US9694016 (2017)
BindingDB Entry DOI: 10.7270/Q2MC8X6W
Serine/threonine-protein kinase B-raf [V600E]
(Homo sapiens (Human))
BDBM202718
(US10245267, Example 111 | US10709712, Example 111 ...)
Show SMILES Cc1ccc(NC(=O)c2cccc(c2)C(F)(F)F)cc1-c1cc(ccn1)N1CCOCC1
Show InChI InChI=1S/C24H22F3N3O2/c1-16-5-6-19(29-23(31)17-3-2-4-18(13-17)24(25,26)27)14-21(16)22-15-20(7-8-28-22)30-9-11-32-12-10-30/h2-8,13-15H,9-12H2,1H3,(H,29,31)
US Patent
n/an/a 0.5n/an/an/an/a7.525
NOVARTIS AG
US Patent
Assay Description
Raf and biotinylated Mek, kinase dead, were combined at 2x final concentrations in assay buffer (50 mM Tris, pH 7.5, 15 mM MgCl2, 0.01% BSA and 1 mM ...
US Patent US9694016 (2017)
BindingDB Entry DOI: 10.7270/Q2MC8X6W
RAF proto-oncogene serine/threonine-protein kinase [Y340E,Y341E]
(Homo sapiens (Human))
BDBM202718
(US10245267, Example 111 | US10709712, Example 111 ...)
Show SMILES Cc1ccc(NC(=O)c2cccc(c2)C(F)(F)F)cc1-c1cc(ccn1)N1CCOCC1
Show InChI InChI=1S/C24H22F3N3O2/c1-16-5-6-19(29-23(31)17-3-2-4-18(13-17)24(25,26)27)14-21(16)22-15-20(7-8-28-22)30-9-11-32-12-10-30/h2-8,13-15H,9-12H2,1H3,(H,29,31)
US Patent
n/an/a 0.400n/an/an/an/a7.525
NOVARTIS AG
US Patent
Assay Description
Raf and biotinylated Mek, kinase dead, were combined at 2x final concentrations in assay buffer (50 mM Tris, pH 7.5, 15 mM MgCl2, 0.01% BSA and 1 mM ...
US Patent US9694016 (2017)
BindingDB Entry DOI: 10.7270/Q2MC8X6W
RAF proto-oncogene serine/threonine-protein kinase
(Homo sapiens (Human))
BDBM202718
(US10245267, Example 111 | US10709712, Example 111 ...)
Show SMILES Cc1ccc(NC(=O)c2cccc(c2)C(F)(F)F)cc1-c1cc(ccn1)N1CCOCC1
Show InChI InChI=1S/C24H22F3N3O2/c1-16-5-6-19(29-23(31)17-3-2-4-18(13-17)24(25,26)27)14-21(16)22-15-20(7-8-28-22)30-9-11-32-12-10-30/h2-8,13-15H,9-12H2,1H3,(H,29,31)
NCI pathway
Reactome pathway
US Patent
n/an/a 0.400n/an/an/an/an/an/a
NOVARTIS AG
US Patent
Assay Description
C-Raf TR refers to a truncated C-Raf protein, a Δ1-324 deletion mutant.C-Raf FL refers to the full-length C-Raf protein.Full length MEK1 with an...
US Patent US10709712 (2020)
Serine/threonine-protein kinase B-raf [V600E]
(Homo sapiens (Human))
BDBM202718
(US10245267, Example 111 | US10709712, Example 111 ...)
Show SMILES Cc1ccc(NC(=O)c2cccc(c2)C(F)(F)F)cc1-c1cc(ccn1)N1CCOCC1
Show InChI InChI=1S/C24H22F3N3O2/c1-16-5-6-19(29-23(31)17-3-2-4-18(13-17)24(25,26)27)14-21(16)22-15-20(7-8-28-22)30-9-11-32-12-10-30/h2-8,13-15H,9-12H2,1H3,(H,29,31)
US Patent
n/an/a 0.5n/an/an/an/an/an/a
Bristol-Myers Squibb Company
Assay Description
Raf and biotinylated Mek, kinase dead, were combined at 2× final concentrations in assay buffer (50 mM Tris, pH 7.5, 15 mM MgCl2, 0.01% BSA and 1 mM ...
Bioorg Med Chem Lett 17: 5115-20 (2007)
BindingDB Entry DOI: 10.7270/Q2RB76WP
RAF proto-oncogene serine/threonine-protein kinase
(Homo sapiens (Human))
BDBM202718
(US10245267, Example 111 | US10709712, Example 111 ...)
Show SMILES Cc1ccc(NC(=O)c2cccc(c2)C(F)(F)F)cc1-c1cc(ccn1)N1CCOCC1
Show InChI InChI=1S/C24H22F3N3O2/c1-16-5-6-19(29-23(31)17-3-2-4-18(13-17)24(25,26)27)14-21(16)22-15-20(7-8-28-22)30-9-11-32-12-10-30/h2-8,13-15H,9-12H2,1H3,(H,29,31)
NCI pathway
Reactome pathway
US Patent
n/an/a 0.400n/an/an/an/an/an/a
Bristol-Myers Squibb Company
Assay Description
Raf and biotinylated Mek, kinase dead, were combined at 2× final concentrations in assay buffer (50 mM Tris, pH 7.5, 15 mM MgCl2, 0.01% BSA and 1 mM ...
Bioorg Med Chem Lett 17: 5115-20 (2007)
BindingDB Entry DOI: 10.7270/Q2RB76WP
RAF proto-oncogene serine/threonine-protein kinase [325-648]
(Homo sapiens (Human))
BDBM202718
(US10245267, Example 111 | US10709712, Example 111 ...)
Show SMILES Cc1ccc(NC(=O)c2cccc(c2)C(F)(F)F)cc1-c1cc(ccn1)N1CCOCC1
Show InChI InChI=1S/C24H22F3N3O2/c1-16-5-6-19(29-23(31)17-3-2-4-18(13-17)24(25,26)27)14-21(16)22-15-20(7-8-28-22)30-9-11-32-12-10-30/h2-8,13-15H,9-12H2,1H3,(H,29,31)
US Patent
n/an/a 0.403n/an/an/an/an/an/a
NOVARTIS AG
US Patent
Assay Description
C-Raf TR refers to a truncated C-Raf protein, a Δ1-324 deletion mutant.C-Raf FL refers to the full-length C-Raf protein.Full length MEK1 with an...
US Patent US10709712 (2020)
Serine/threonine-protein kinase B-raf [V600E]
(Homo sapiens (Human))
BDBM202718
(US10245267, Example 111 | US10709712, Example 111 ...)
Show SMILES Cc1ccc(NC(=O)c2cccc(c2)C(F)(F)F)cc1-c1cc(ccn1)N1CCOCC1
Show InChI InChI=1S/C24H22F3N3O2/c1-16-5-6-19(29-23(31)17-3-2-4-18(13-17)24(25,26)27)14-21(16)22-15-20(7-8-28-22)30-9-11-32-12-10-30/h2-8,13-15H,9-12H2,1H3,(H,29,31)
US Patent
n/an/a 0.5n/an/an/an/an/an/a
NOVARTIS AG
US Patent
Assay Description
C-Raf TR refers to a truncated C-Raf protein, a Δ1-324 deletion mutant.C-Raf FL refers to the full-length C-Raf protein.Full length MEK1 with an...
US Patent US10709712 (2020)
RAF proto-oncogene serine/threonine-protein kinase [1-324]
(Homo sapiens (Human))
BDBM202718
(US10245267, Example 111 | US10709712, Example 111 ...)
Show SMILES Cc1ccc(NC(=O)c2cccc(c2)C(F)(F)F)cc1-c1cc(ccn1)N1CCOCC1
Show InChI InChI=1S/C24H22F3N3O2/c1-16-5-6-19(29-23(31)17-3-2-4-18(13-17)24(25,26)27)14-21(16)22-15-20(7-8-28-22)30-9-11-32-12-10-30/h2-8,13-15H,9-12H2,1H3,(H,29,31)
US Patent
n/an/a 0.403n/an/an/an/an/an/a
Bristol-Myers Squibb Company
Assay Description
Raf and biotinylated Mek, kinase dead, were combined at 2× final concentrations in assay buffer (50 mM Tris, pH 7.5, 15 mM MgCl2, 0.01% BSA and 1 mM ...
Bioorg Med Chem Lett 17: 5115-20 (2007)
BindingDB Entry DOI: 10.7270/Q2RB76WP