BDBM20288 2-[(4-tert-butylphenyl)methyl]-3-[1-(3-fluoro-4-methanesulfonamidophenyl)acetamido]propyl 2,2-dimethylpropanoate::CHEMBL72104::amide analogue, 3
SMILES: CC(C)(C)C(=O)OCC(CNC(=O)Cc1ccc(NS(C)(=O)=O)c(F)c1)Cc1ccc(cc1)C(C)(C)C
InChI Key: InChIKey=RERDOWROKULWDB-UHFFFAOYSA-N
Data: 2 KI  1 IC50  1 EC50
Activity Spreadsheet -- Enzyme Inhibition Constant Data from BindingDB
Found 3 hits for monomerid = 20288
Trg + Lig
Ki
nM
ΔG°
kcal/mole
IC50
nM
Kd
nM
EC50/IC50
nM
koff
s-1
kon
M-1s-1
pHTemp
°C
Vanilloid receptor
(Rattus norvegicus (rat))
BDBM20288
(2-[(4-tert-butylphenyl)methyl]-3-[1-(3-fluoro-4-me...)
Show SMILES CC(C)(C)C(=O)OCC(CNC(=O)Cc1ccc(NS(C)(=O)=O)c(F)c1)Cc1ccc(cc1)C(C)(C)C
Show InChI InChI=1S/C28H39FN2O5S/c1-27(2,3)22-11-8-19(9-12-22)14-21(18-36-26(33)28(4,5)6)17-30-25(32)16-20-10-13-24(23(29)15-20)31-37(7,34)35/h8-13,15,21,31H,14,16-18H2,1-7H3,(H,30,32)
Reactome pathway
74 -10.1n/an/a 440n/an/a7.437
Seoul National University
Assay Description
Binding assay mixtures were set up and contained [3H] RTX, various concentrations of competing ligands, and rVR1-transfected CHO cells. Nonspecific b...
J Med Chem 51: 57-67 (2008)
Article DOI: 10.1021/jm701049p
BindingDB Entry DOI: 10.7270/Q2222S1N
Vanilloid receptor
(Rattus norvegicus (rat))
BDBM20288
(2-[(4-tert-butylphenyl)methyl]-3-[1-(3-fluoro-4-me...)
Show SMILES CC(C)(C)C(=O)OCC(CNC(=O)Cc1ccc(NS(C)(=O)=O)c(F)c1)Cc1ccc(cc1)C(C)(C)C
Show InChI InChI=1S/C28H39FN2O5S/c1-27(2,3)22-11-8-19(9-12-22)14-21(18-36-26(33)28(4,5)6)17-30-25(32)16-20-10-13-24(23(29)15-20)31-37(7,34)35/h8-13,15,21,31H,14,16-18H2,1-7H3,(H,30,32)
Reactome pathway
74n/an/an/an/an/an/an/an/a
Seoul National University
Curated by ChEMBL
Assay Description
Binding affinity towards rat vanilloid receptor subtype 1 expressed in CHO cells by [3H]-RTX displacement.
Bioorg Med Chem Lett 14: 2291-7 (2004)
Article DOI: 10.1016/j.bmcl.2004.02.002
BindingDB Entry DOI: 10.7270/Q2TT4QCG
Vanilloid receptor
(Rattus norvegicus (rat))
BDBM20288
(2-[(4-tert-butylphenyl)methyl]-3-[1-(3-fluoro-4-me...)
Show SMILES CC(C)(C)C(=O)OCC(CNC(=O)Cc1ccc(NS(C)(=O)=O)c(F)c1)Cc1ccc(cc1)C(C)(C)C
Show InChI InChI=1S/C28H39FN2O5S/c1-27(2,3)22-11-8-19(9-12-22)14-21(18-36-26(33)28(4,5)6)17-30-25(32)16-20-10-13-24(23(29)15-20)31-37(7,34)35/h8-13,15,21,31H,14,16-18H2,1-7H3,(H,30,32)
Reactome pathway
n/an/a 440n/an/an/an/an/an/a
Seoul National University
Curated by ChEMBL
Assay Description
Binding affinity towards rat vanilloid receptor subtype 1 expressed in CHO cells by [3H]-RTX displacement.
Bioorg Med Chem Lett 14: 2291-7 (2004)
Article DOI: 10.1016/j.bmcl.2004.02.002
BindingDB Entry DOI: 10.7270/Q2TT4QCG