BDBM20308 (2R)-2-benzyl-3-[(2S)-2-(3-fluoro-4-methanesulfonamidophenyl)propanamido]propyl 2,2-dimethylpropanoate::benzyl derivative, 70
SMILES: C[C@H](C(=O)NC[C@H](COC(=O)C(C)(C)C)Cc1ccccc1)c1ccc(NS(C)(=O)=O)c(F)c1
InChI Key: InChIKey=LJHJNIOBCLQUIS-PKOBYXMFSA-N
Data: 1 KI  1 EC50
Activity Spreadsheet -- Enzyme Inhibition Constant Data from BindingDB
Found 1 hit for monomerid = 20308
Trg + Lig
Ki
nM
ΔG°
kcal/mole
IC50
nM
Kd
nM
EC50/IC50
nM
koff
s-1
kon
M-1s-1
pHTemp
°C
Vanilloid receptor
(Rattus norvegicus (rat))
BDBM20308
((2R)-2-benzyl-3-[(2S)-2-(3-fluoro-4-methanesulfona...)
Show SMILES C[C@H](C(=O)NC[C@H](COC(=O)C(C)(C)C)Cc1ccccc1)c1ccc(NS(C)(=O)=O)c(F)c1 |r|
Show InChI InChI=1S/C25H33FN2O5S/c1-17(20-11-12-22(21(26)14-20)28-34(5,31)32)23(29)27-15-19(13-18-9-7-6-8-10-18)16-33-24(30)25(2,3)4/h6-12,14,17,19,28H,13,15-16H2,1-5H3,(H,27,29)/t17-,19+/m0/s1
Reactome pathway
43 -10.4n/an/a 8.56n/an/a7.437
Seoul National University
Assay Description
Binding assay mixtures were set up and contained [3H] RTX, various concentrations of competing ligands, and rVR1-transfected CHO cells. Nonspecific b...
J Med Chem 51: 57-67 (2008)
Article DOI: 10.1021/jm701049p
BindingDB Entry DOI: 10.7270/Q2222S1N