BDBM2033 2,8-disubstituted dipyridodiazepinone 14::2-Chloro-5,11-dihydro-11-ethyl-8-(4-fluorophenyloxy)-methyl-5-methyl-6H-dipyrido[3,2-b:2 ,3 -e][1,4]diazepin-6-one::5-chloro-2-ethyl-13-(4-fluorophenoxymethyl)-9-methyl-2,4,9,15-tetraazatricyclo[9.4.0.0^{3,8}]pentadeca-1(11),3,5,7,12,14-hexaen-10-one
SMILES: CCN1c2nc(Cl)ccc2N(C)C(=O)c2cc(COc3ccc(F)cc3)cnc12
InChI Key: InChIKey=SDHDKVPVUDEWQJ-UHFFFAOYSA-N
Data: 3 IC50
Activity Spreadsheet -- Enzyme Inhibition Constant Data from BindingDB
Found 3 hits for monomerid = 2033
Trg + Lig
Ki
nM
ΔG°
kcal/mole
IC50
nM
Kd
nM
EC50/IC50
nM
koff
s-1
kon
M-1s-1
pHTemp
°C
Gag-Pol polyprotein [600-1027,R876K]/[600-1155]
(Human immunodeficiency virus type 1)
BDBM2033
(2,8-disubstituted dipyridodiazepinone 14 | 2-Chlor...)
Show SMILES CCN1c2nc(Cl)ccc2N(C)C(=O)c2cc(COc3ccc(F)cc3)cnc12
Show InChI InChI=1S/C21H18ClFN4O2/c1-3-27-19-16(21(28)26(2)17-8-9-18(22)25-20(17)27)10-13(11-24-19)12-29-15-6-4-14(23)5-7-15/h4-11H,3,12H2,1-2H3
n/an/a 280n/an/an/an/a7.822
Boehringer Ingelheim Pharmaceuticals Inc.
Assay Description
The IC50 of reverse transcriptase is the concentration that inhibits 50% of recombinant HIV-1 RT RNA-directed DNA polymerase activity in vitro.
J Med Chem 41: 2972-84 (1998)
Article DOI: 10.1021/jm9707030
BindingDB Entry DOI: 10.7270/Q2J964K7
Reverse transcriptase/RNaseH
(Human immunodeficiency virus 1)
BDBM2033
(2,8-disubstituted dipyridodiazepinone 14 | 2-Chlor...)
Show SMILES CCN1c2nc(Cl)ccc2N(C)C(=O)c2cc(COc3ccc(F)cc3)cnc12
Show InChI InChI=1S/C21H18ClFN4O2/c1-3-27-19-16(21(28)26(2)17-8-9-18(22)25-20(17)27)10-13(11-24-19)12-29-15-6-4-14(23)5-7-15/h4-11H,3,12H2,1-2H3
n/an/a 280n/an/an/an/an/an/a
Boehringer Ingelheim Pharmaceuticals Inc.
Assay Description
Inhibitory activity against HIV-1 wild-type reverse transcriptase.
J Med Chem 41: 2972-84 (1998)
Article DOI: 10.1021/jm9707030
BindingDB Entry DOI: 10.7270/Q2J964K7
Gag-Pol polyprotein [600-1027,Y780C]/[600-1155,Y780C]
(Human immunodeficiency virus type 1)
BDBM2033
(2,8-disubstituted dipyridodiazepinone 14 | 2-Chlor...)
Show SMILES CCN1c2nc(Cl)ccc2N(C)C(=O)c2cc(COc3ccc(F)cc3)cnc12
Show InChI InChI=1S/C21H18ClFN4O2/c1-3-27-19-16(21(28)26(2)17-8-9-18(22)25-20(17)27)10-13(11-24-19)12-29-15-6-4-14(23)5-7-15/h4-11H,3,12H2,1-2H3
n/an/a 1.66E+3n/an/an/an/a7.822
Boehringer Ingelheim Pharmaceuticals Inc.
Assay Description
The IC50 of reverse transcriptase is the concentration that inhibits 50% of recombinant HIV-1 RT RNA-directed DNA polymerase activity in vitro.
J Med Chem 41: 2972-84 (1998)
Article DOI: 10.1021/jm9707030
BindingDB Entry DOI: 10.7270/Q2J964K7