BDBM203447 US9242981, 145
SMILES: CN1CC(NC(=O)N2CCc3[nH]nc(c3C2)-c2ccc3OCCc3c2)C(C1)c1ccccc1C
InChI Key:
Data: 1 IC50
Activity Spreadsheet -- Enzyme Inhibition Constant Data from BindingDB
Found 1 hit for monomerid = 203447
Trg + Lig
Ki
nM
ΔG°
kcal/mole
IC50
nM
Kd
nM
EC50/IC50
nM
koff
s-1
kon
M-1s-1
pHTemp
°C
Mitogen-activated protein kinase 1
(Mus musculus (Mouse))
BDBM203447
(US9242981, 145)
Show SMILES CN1CC(NC(=O)N2CCc3[nH]nc(c3C2)-c2ccc3OCCc3c2)C(C1)c1ccccc1C
Reactome pathway
US Patent
n/an/a 1.52n/an/an/an/an/an/a
Merck Sharp & Dohme Corp.
US Patent
Assay Description
Activated ERK2 activity was also determined in the IMAP assay format using the procedure outlined above. 1 μl of 25× compound was added to 14 &#...
US Patent US9242981 (2016)
BindingDB Entry DOI: 10.7270/Q2GM864G