BDBM203509 US9221809, 46
SMILES: C[C@H]1C[C@@H](Nc2nc([nH]c(=O)c2-c2ccc3ccccc3n2)N2CCOCC2)[C@H](O)[C@@H]1O
InChI Key:
Data: 1 IC50
Activity Spreadsheet -- Enzyme Inhibition Constant Data from BindingDB
Found 1 hit for monomerid = 203509
Trg + Lig
Ki
nM
ΔG°
kcal/mole
IC50
nM
Kd
nM
EC50/IC50
nM
koff
s-1
kon
M-1s-1
pHTemp
°C
Interleukin-1 receptor-associated kinase 4
(Homo sapiens (Human))
BDBM203509
(US9221809, 46)
Show SMILES C[C@H]1C[C@@H](Nc2nc([nH]c(=O)c2-c2ccc3ccccc3n2)N2CCOCC2)[C@H](O)[C@@H]1O |r|
Reactome pathway
US Patent
n/an/a 5n/an/an/an/a7.225
MERCK SHARP & DOHME CORP.
US Patent
Assay Description
A 20 ul reaction mixture contains 10 mM TriHCl, pH 7.2, 0.5 nM GST tagged IRAK4 (SignalChem), 100 nM fluorescent peptide substrate (RP7030, Molecul...
US Patent US9221809 (2015)
BindingDB Entry DOI: 10.7270/Q23B5XZM