BDBM203662 US9539260, B109::US9763952, Example B109
SMILES: COc1ncc(cc1Cl)N1CCOc2ccc(O[C@H]3CCN(C3)C(=O)CC#N)cc12
InChI Key: InChIKey=NWMIBEGCSJJUIM-INIZCTEOSA-N
Data: 4 IC50
Activity Spreadsheet -- Enzyme Inhibition Constant Data from BindingDB
Found 4 hits for monomerid = 203662
Trg + Lig
Ki
nM
ΔG°
kcal/mole
IC50
nM
Kd
nM
EC50/IC50
nM
koff
s-1
kon
M-1s-1
pHTemp
°C
Phosphatidylinositol 4,5-bisphosphate 3-kinase catalytic subunit alpha isoform
(Homo sapiens (Human))
BDBM203662
(US9539260, B109 | US9763952, Example B109)
Show SMILES COc1ncc(cc1Cl)N1CCOc2ccc(O[C@H]3CCN(C3)C(=O)CC#N)cc12 |r|
Show InChI InChI=1S/C21H21ClN4O4/c1-28-21-17(22)10-14(12-24-21)26-8-9-29-19-3-2-15(11-18(19)26)30-16-5-7-25(13-16)20(27)4-6-23/h2-3,10-12,16H,4-5,7-9,13H2,1H3/t16-/m0/s1
NCI pathway
Reactome pathway
US Patent
n/an/a 118n/an/an/an/an/a25
NOVARTIS AG
US Patent
Assay Description
Determination of Enzymatic PI3K Alpha and PI3K Delta Isoform Inhibition1.1 Test of Lipid Kinase ActivityThe efficacy of the compounds of examples 1-1...
US Patent US9539260 (2017)
BindingDB Entry DOI: 10.7270/Q2W37TH1
Phosphatidylinositol 4,5-bisphosphate 3-kinase catalytic subunit delta isoform
(Homo sapiens (Human))
BDBM203662
(US9539260, B109 | US9763952, Example B109)
Show SMILES COc1ncc(cc1Cl)N1CCOc2ccc(O[C@H]3CCN(C3)C(=O)CC#N)cc12 |r|
Show InChI InChI=1S/C21H21ClN4O4/c1-28-21-17(22)10-14(12-24-21)26-8-9-29-19-3-2-15(11-18(19)26)30-16-5-7-25(13-16)20(27)4-6-23/h2-3,10-12,16H,4-5,7-9,13H2,1H3/t16-/m0/s1
NCI pathway
Reactome pathway
US Patent
n/an/a<3n/an/an/an/an/an/a
NOVARTIS AG
US Patent
US Patent US9763952 (2017)
BindingDB Entry DOI: 10.7270/Q2V40X9Z
Phosphatidylinositol 4,5-bisphosphate 3-kinase catalytic subunit alpha isoform
(Homo sapiens (Human))
BDBM203662
(US9539260, B109 | US9763952, Example B109)
Show SMILES COc1ncc(cc1Cl)N1CCOc2ccc(O[C@H]3CCN(C3)C(=O)CC#N)cc12 |r|
Show InChI InChI=1S/C21H21ClN4O4/c1-28-21-17(22)10-14(12-24-21)26-8-9-29-19-3-2-15(11-18(19)26)30-16-5-7-25(13-16)20(27)4-6-23/h2-3,10-12,16H,4-5,7-9,13H2,1H3/t16-/m0/s1
NCI pathway
Reactome pathway
US Patent
n/an/a 118n/an/an/an/an/an/a
NOVARTIS AG
US Patent
Assay Description
The kinase reaction is performed in a final volume of 50 μl per well of a half area COSTAR, 96 well plate. The final concentrations of ATP and p...
US Patent US9763952 (2017)
BindingDB Entry DOI: 10.7270/Q2V40X9Z
Phosphatidylinositol 4,5-bisphosphate 3-kinase catalytic subunit delta isoform
(Homo sapiens (Human))
BDBM203662
(US9539260, B109 | US9763952, Example B109)
Show SMILES COc1ncc(cc1Cl)N1CCOc2ccc(O[C@H]3CCN(C3)C(=O)CC#N)cc12 |r|
Show InChI InChI=1S/C21H21ClN4O4/c1-28-21-17(22)10-14(12-24-21)26-8-9-29-19-3-2-15(11-18(19)26)30-16-5-7-25(13-16)20(27)4-6-23/h2-3,10-12,16H,4-5,7-9,13H2,1H3/t16-/m0/s1
NCI pathway
Reactome pathway
US Patent
n/an/a<3n/an/an/an/an/a25
NOVARTIS AG
US Patent
Assay Description
Determination of Enzymatic PI3K Alpha and PI3K Delta Isoform Inhibition1.1 Test of Lipid Kinase ActivityThe efficacy of the compounds of examples 1-1...
US Patent US9539260 (2017)
BindingDB Entry DOI: 10.7270/Q2W37TH1