BDBM204087 US9539260, F4::US9763952, Example F4
SMILES: COc1ncc(cc1C#N)N1CCOc2cnc(O[C@H]3CCN(C3)C(=O)C3CCOCC3)cc12
InChI Key: InChIKey=XUHPBCWECDJQQR-IBGZPJMESA-N
Data: 4 IC50
Activity Spreadsheet -- Enzyme Inhibition Constant Data from BindingDB
Found 4 hits for monomerid = 204087
Trg + Lig
Ki
nM
ΔG°
kcal/mole
IC50
nM
Kd
nM
EC50/IC50
nM
koff
s-1
kon
M-1s-1
pHTemp
°C
Phosphatidylinositol 4,5-bisphosphate 3-kinase catalytic subunit alpha isoform
(Homo sapiens (Human))
BDBM204087
(US9539260, F4 | US9763952, Example F4)
Show SMILES COc1ncc(cc1C#N)N1CCOc2cnc(O[C@H]3CCN(C3)C(=O)C3CCOCC3)cc12 |r|
Show InChI InChI=1S/C24H27N5O5/c1-31-23-17(12-25)10-18(13-27-23)29-6-9-33-21-14-26-22(11-20(21)29)34-19-2-5-28(15-19)24(30)16-3-7-32-8-4-16/h10-11,13-14,16,19H,2-9,15H2,1H3/t19-/m0/s1
NCI pathway
Reactome pathway
US Patent
n/an/a 577n/an/an/an/an/a25
NOVARTIS AG
US Patent
Assay Description
Determination of Enzymatic PI3K Alpha and PI3K Delta Isoform Inhibition1.1 Test of Lipid Kinase ActivityThe efficacy of the compounds of examples 1-1...
US Patent US9539260 (2017)
BindingDB Entry DOI: 10.7270/Q2W37TH1
Phosphatidylinositol 4,5-bisphosphate 3-kinase catalytic subunit delta isoform
(Homo sapiens (Human))
BDBM204087
(US9539260, F4 | US9763952, Example F4)
Show SMILES COc1ncc(cc1C#N)N1CCOc2cnc(O[C@H]3CCN(C3)C(=O)C3CCOCC3)cc12 |r|
Show InChI InChI=1S/C24H27N5O5/c1-31-23-17(12-25)10-18(13-27-23)29-6-9-33-21-14-26-22(11-20(21)29)34-19-2-5-28(15-19)24(30)16-3-7-32-8-4-16/h10-11,13-14,16,19H,2-9,15H2,1H3/t19-/m0/s1
NCI pathway
Reactome pathway
US Patent
n/an/a 3n/an/an/an/an/an/a
NOVARTIS AG
US Patent
US Patent US9763952 (2017)
BindingDB Entry DOI: 10.7270/Q2V40X9Z
Phosphatidylinositol 4,5-bisphosphate 3-kinase catalytic subunit alpha isoform
(Homo sapiens (Human))
BDBM204087
(US9539260, F4 | US9763952, Example F4)
Show SMILES COc1ncc(cc1C#N)N1CCOc2cnc(O[C@H]3CCN(C3)C(=O)C3CCOCC3)cc12 |r|
Show InChI InChI=1S/C24H27N5O5/c1-31-23-17(12-25)10-18(13-27-23)29-6-9-33-21-14-26-22(11-20(21)29)34-19-2-5-28(15-19)24(30)16-3-7-32-8-4-16/h10-11,13-14,16,19H,2-9,15H2,1H3/t19-/m0/s1
NCI pathway
Reactome pathway
US Patent
n/an/a 577n/an/an/an/an/an/a
NOVARTIS AG
US Patent
Assay Description
The kinase reaction is performed in a final volume of 50 μl per well of a half area COSTAR, 96 well plate. The final concentrations of ATP and p...
US Patent US9763952 (2017)
BindingDB Entry DOI: 10.7270/Q2V40X9Z
Phosphatidylinositol 4,5-bisphosphate 3-kinase catalytic subunit delta isoform
(Homo sapiens (Human))
BDBM204087
(US9539260, F4 | US9763952, Example F4)
Show SMILES COc1ncc(cc1C#N)N1CCOc2cnc(O[C@H]3CCN(C3)C(=O)C3CCOCC3)cc12 |r|
Show InChI InChI=1S/C24H27N5O5/c1-31-23-17(12-25)10-18(13-27-23)29-6-9-33-21-14-26-22(11-20(21)29)34-19-2-5-28(15-19)24(30)16-3-7-32-8-4-16/h10-11,13-14,16,19H,2-9,15H2,1H3/t19-/m0/s1
NCI pathway
Reactome pathway
US Patent
n/an/a 3n/an/an/an/an/a25
NOVARTIS AG
US Patent
Assay Description
Determination of Enzymatic PI3K Alpha and PI3K Delta Isoform Inhibition1.1 Test of Lipid Kinase ActivityThe efficacy of the compounds of examples 1-1...
US Patent US9539260 (2017)
BindingDB Entry DOI: 10.7270/Q2W37TH1