BDBM204241 US9242996, 315
SMILES: NC[C@@H](NC(=O)c1ccc(cc1F)-c1nc(cnc1N)[C@@H]1CC[C@@H](O)[C@H](F)C1)c1cc(F)cc(I)c1
InChI Key: InChIKey=FNPAUBUDJRCBPC-UZWLDWCWSA-N
Data: 1 IC50
Activity Spreadsheet -- Enzyme Inhibition Constant Data from BindingDB
Found 1 hit for monomerid = 204241
Trg + Lig
Ki
nM
ΔG°
kcal/mole
IC50
nM
Kd
nM
EC50/IC50
nM
koff
s-1
kon
M-1s-1
pHTemp
°C
Mitogen-activated protein kinase 1
(Homo sapiens (Human))
BDBM204241
(US9242996, 315)
Show SMILES NC[C@@H](NC(=O)c1ccc(cc1F)-c1nc(cnc1N)[C@@H]1CC[C@@H](O)[C@H](F)C1)c1cc(F)cc(I)c1 |r|
Show InChI InChI=1S/C25H25F3IN5O2/c26-15-5-14(6-16(29)9-15)20(10-30)34-25(36)17-3-1-13(8-18(17)27)23-24(31)32-11-21(33-23)12-2-4-22(35)19(28)7-12/h1,3,5-6,8-9,11-12,19-20,22,35H,2,4,7,10,30H2,(H2,31,32)(H,34,36)/t12-,19-,20-,22-/m1/s1
NCI pathway
Reactome pathway
US Patent
n/an/a 0.00500n/an/an/an/a7.5n/a
Novartis AG
US Patent
Assay Description
Compound potency against activated ERK2 was determined using a kinase assay that measures ERK2-catalyzed phosphorylation of biotinylated ERKtide pept...
US Patent US9242996 (2016)
BindingDB Entry DOI: 10.7270/Q2XP73RN