BDBM204308 US9242996, 387
SMILES: CSc1cccc(c1)[C@@H](CO)NC(=O)c1ccc(cc1F)-c1nc(cnc1N)C1CCOCC1
InChI Key: InChIKey=RKUQEKVAKZGSGS-JOCHJYFZSA-N
Data: 1 IC50
Activity Spreadsheet -- Enzyme Inhibition Constant Data from BindingDB
Found 1 hit for monomerid = 204308
Trg + Lig
Ki
nM
ΔG°
kcal/mole
IC50
nM
Kd
nM
EC50/IC50
nM
koff
s-1
kon
M-1s-1
pHTemp
°C
Mitogen-activated protein kinase 1
(Homo sapiens (Human))
BDBM204308
(US9242996, 387)
Show SMILES CSc1cccc(c1)[C@@H](CO)NC(=O)c1ccc(cc1F)-c1nc(cnc1N)C1CCOCC1 |r|
Show InChI InChI=1S/C25H27FN4O3S/c1-34-18-4-2-3-16(11-18)22(14-31)30-25(32)19-6-5-17(12-20(19)26)23-24(27)28-13-21(29-23)15-7-9-33-10-8-15/h2-6,11-13,15,22,31H,7-10,14H2,1H3,(H2,27,28)(H,30,32)/t22-/m1/s1
NCI pathway
Reactome pathway
US Patent
n/an/a 0.0100n/an/an/an/a7.5n/a
Novartis AG
US Patent
Assay Description
Compound potency against activated ERK2 was determined using a kinase assay that measures ERK2-catalyzed phosphorylation of biotinylated ERKtide pept...
US Patent US9242996 (2016)
BindingDB Entry DOI: 10.7270/Q2XP73RN