BDBM204496 US9242996, 206
SMILES: Cc1nn(cc1-c1cnc(N)c(c1)-c1ccc(C(=O)N[C@H](CO)c2cc(F)cc(CF)c2)c(F)c1)C(F)F
InChI Key: InChIKey=CFKSUAFQUIDJIM-HSZRJFAPSA-N
Data: 1 IC50
Activity Spreadsheet -- Enzyme Inhibition Constant Data from BindingDB
Found 1 hit for monomerid = 204496
Trg + Lig
Ki
nM
ΔG°
kcal/mole
IC50
nM
Kd
nM
EC50/IC50
nM
koff
s-1
kon
M-1s-1
pHTemp
°C
Mitogen-activated protein kinase 1
(Homo sapiens (Human))
BDBM204496
(US9242996, 206)
Show SMILES Cc1nn(cc1-c1cnc(N)c(c1)-c1ccc(C(=O)N[C@H](CO)c2cc(F)cc(CF)c2)c(F)c1)C(F)F
Show InChI InChI=1S/C26H22F5N5O2/c1-13-21(11-36(35-13)26(30)31)17-7-20(24(32)33-10-17)15-2-3-19(22(29)8-15)25(38)34-23(12-37)16-4-14(9-27)5-18(28)6-16/h2-8,10-11,23,26,37H,9,12H2,1H3,(H2,32,33)(H,34,38)/t23-/m1/s1
NCI pathway
Reactome pathway
US Patent
n/an/a 0.0104n/an/an/an/a7.5n/a
Novartis AG
US Patent
Assay Description
Compound potency against activated ERK2 was determined using a kinase assay that measures ERK2-catalyzed phosphorylation of biotinylated ERKtide pept...
US Patent US9242996 (2016)
BindingDB Entry DOI: 10.7270/Q2XP73RN