BDBM204715 US9243002, 55
SMILES: CNC(=O)c1c(oc2cc(N(C)S(C)(=O)=O)c(cc12)-c1ccc2C(CO)n3c(cc4c(F)cccc34)-c2n1)-c1ccc(F)cc1
InChI Key: InChIKey=ZVTSTMMOWMDFAK-UHFFFAOYSA-N
Data: 2 IC50
Activity Spreadsheet -- Enzyme Inhibition Constant Data from BindingDB
Found 2 hits for monomerid = 204715
Trg + Lig
Ki
nM
ΔG°
kcal/mole
IC50
nM
Kd
nM
EC50/IC50
nM
koff
s-1
kon
M-1s-1
pHTemp
°C
Genome polyprotein
(Hepatitis C Virus (Virus))
BDBM204715
(US9243002, 55)
Show SMILES CNC(=O)c1c(oc2cc(N(C)S(C)(=O)=O)c(cc12)-c1ccc2C(CO)n3c(cc4c(F)cccc34)-c2n1)-c1ccc(F)cc1
Show InChI InChI=1S/C33H26F2N4O5S/c1-36-33(41)30-22-13-21(26(38(2)45(3,42)43)15-29(22)44-32(30)17-7-9-18(34)10-8-17)24-12-11-19-28(16-40)39-25-6-4-5-23(35)20(25)14-27(39)31(19)37-24/h4-15,28,40H,16H2,1-3H3,(H,36,41)
US Patent
n/an/a 1.81n/an/an/an/an/an/a
Merck Sharp & Dohme Corp.
US Patent
Assay Description
To initiate an assay, replicon cells were plated in the presence of a dilution series of test compound in the absence of G418. Typically, the assays ...
US Patent US9243002 (2016)
BindingDB Entry DOI: 10.7270/Q2P55MBC
Genome polyprotein
(Hepatitis C virus (HCV genotype 1a, isolate H))
BDBM204715
(US9243002, 55)
Show SMILES CNC(=O)c1c(oc2cc(N(C)S(C)(=O)=O)c(cc12)-c1ccc2C(CO)n3c(cc4c(F)cccc34)-c2n1)-c1ccc(F)cc1
Show InChI InChI=1S/C33H26F2N4O5S/c1-36-33(41)30-22-13-21(26(38(2)45(3,42)43)15-29(22)44-32(30)17-7-9-18(34)10-8-17)24-12-11-19-28(16-40)39-25-6-4-5-23(35)20(25)14-27(39)31(19)37-24/h4-15,28,40H,16H2,1-3H3,(H,36,41)
US Patent
n/an/a 0.971n/an/an/an/an/an/a
Merck Sharp & Dohme Corp.
US Patent
Assay Description
To initiate an assay, replicon cells were plated in the presence of a dilution series of test compound in the absence of G418. Typically, the assays ...
US Patent US9243002 (2016)
BindingDB Entry DOI: 10.7270/Q2P55MBC