null
SMILES: CN(CCNC(=O)Nc1ccccc1Br)c1cccc(C)c1
InChI Key: InChIKey=GECSVPIMSOPKGK-UHFFFAOYSA-N
Activity Spreadsheet -- Enzyme Inhibition Constant Data from BindingDB
Found 1 hit for monomerid = 20479
Trg + Lig
Ki
nM
ΔG°
kcal/mole
IC50
nM
Kd
nM
EC50/IC50
nM
koff
s-1
kon
M-1s-1
pHTemp
°C
Transient receptor potential cation channel subfamily V member 1
(Homo sapiens (Human))
BDBM20479
(1-(2-bromophenyl)-3-{2-[methyl(3-methylphenyl)amin...)
Show SMILES CN(CCNC(=O)Nc1ccccc1Br)c1cccc(C)c1
Show InChI InChI=1S/C17H20BrN3O/c1-13-6-5-7-14(12-13)21(2)11-10-19-17(22)20-16-9-4-3-8-15(16)18/h3-9,12H,10-11H2,1-2H3,(H2,19,20,22)
Reactome pathway
n/an/an/an/a 40n/an/a7.225
GSK
Assay Description
One day before the assay was performed, human TRPV1 expressed in 1321N1 astrocytoma cells were plated onto 96-well assay plates and grown until 2.5 h...
Bioorg Med Chem Lett 14: 3631-4 (2004)
Article DOI: 10.1016/j.bmcl.2004.05.028
BindingDB Entry DOI: 10.7270/Q24T6GM8