null
SMILES: COCCOc1ccccc1-c1ccccc1-c1nnnn1-c1ccccc1F
InChI Key: InChIKey=GVRUVTCYLQOHQH-UHFFFAOYSA-N
Activity Spreadsheet -- Enzyme Inhibition Constant Data from BindingDB
Found 1 hit for monomerid = 205019
Trg + Lig
Ki
nM
ΔG°
kcal/mole
IC50
nM
Kd
nM
EC50/IC50
nM
koff
s-1
kon
M-1s-1
pHTemp
°C
Intermediate conductance calcium-activated potassium channel protein 4
(Homo sapiens (Human))
BDBM205019
(US9556132, 4 | process for preparing 1-(2-fluoroph...)
Show SMILES COCCOc1ccccc1-c1ccccc1-c1nnnn1-c1ccccc1F
Show InChI InChI=1S/C22H19FN4O2/c1-28-14-15-29-21-13-7-4-9-17(21)16-8-2-3-10-18(16)22-24-25-26-27(22)20-12-6-5-11-19(20)23/h2-13H,14-15H2,1H3
Reactome pathway
US Patent
n/an/a 30n/an/an/an/a7.3n/a
Saniona A/S
US Patent
Assay Description
Human HEK293 cells over-expressing human IK are grown in culture medium (DMEM supplemented with 10% foetal bovine serum), in polystyrene culture flas...
US Patent US9556132 (2017)
BindingDB Entry DOI: 10.7270/Q2SF2Z5T