BDBM205094 US9556147, 3
SMILES: Cn1c2C[C@@H](O)Cc3c(cccc3-n3ncc4cc(cc(F)c4c3=O)C(C)(C)C)-c2cc(Nc2ccc(cn2)C(=O)N2CCOCC2)c1=O
InChI Key: InChIKey=ACFBKRAWAGNCMP-DEOSSOPVSA-N
Data: 3 IC50
PDB links: 1 PDB ID matches this monomer.
Activity Spreadsheet -- Enzyme Inhibition Constant Data from BindingDB
Found 3 hits for monomerid = 205094
Trg + Lig
Ki
nM
ΔG°
kcal/mole
IC50
nM
Kd
nM
EC50/IC50
nM
koff
s-1
kon
M-1s-1
pHTemp
°C
Tyrosine-protein kinase BTK
(Homo sapiens (Human))
BDBM205094
(US9556147, 3)
Show SMILES Cn1c2C[C@@H](O)Cc3c(cccc3-n3ncc4cc(cc(F)c4c3=O)C(C)(C)C)-c2cc(Nc2ccc(cn2)C(=O)N2CCOCC2)c1=O |r|
Show InChI InChI=1S/C37H37FN6O5/c1-37(2,3)23-14-22-20-40-44(36(48)33(22)28(38)15-23)30-7-5-6-25-26(30)16-24(45)17-31-27(25)18-29(35(47)42(31)4)41-32-9-8-21(19-39-32)34(46)43-10-12-49-13-11-43/h5-9,14-15,18-20,24,45H,10-13,16-17H2,1-4H3,(H,39,41)/t24-/m0/s1
NCI pathway
Reactome pathway
US Patent
n/an/a 0.910n/an/an/an/a7.2n/a
HOFFMANN-LA INC.
US Patent
Assay Description
The assay is a capture of radioactive 33P phosphorylated product through filtration. The interactions of BTK, biotinylated SH2 peptide substrate (Src...
US Patent US9556147 (2017)
BindingDB Entry DOI: 10.7270/Q2HX1FP9
3D
3D Structure (crystal)
Tyrosine-protein kinase BTK
(Homo sapiens (Human))
BDBM205094
(US9556147, 3)
Show SMILES Cn1c2C[C@@H](O)Cc3c(cccc3-n3ncc4cc(cc(F)c4c3=O)C(C)(C)C)-c2cc(Nc2ccc(cn2)C(=O)N2CCOCC2)c1=O |r|
Show InChI InChI=1S/C37H37FN6O5/c1-37(2,3)23-14-22-20-40-44(36(48)33(22)28(38)15-23)30-7-5-6-25-26(30)16-24(45)17-31-27(25)18-29(35(47)42(31)4)41-32-9-8-21(19-39-32)34(46)43-10-12-49-13-11-43/h5-9,14-15,18-20,24,45H,10-13,16-17H2,1-4H3,(H,39,41)/t24-/m0/s1
NCI pathway
Reactome pathway
n/an/a<1n/an/an/an/an/an/a
Hoffmann-La Roche Ltd.
Curated by ChEMBL
Assay Description
Inhibition of Kinase Tracer 178 binding to biotinylated-BTK (unknown origin) measured after 18 to 24 hrs by Europium-labeled Streptavidin conjugate b...
Bioorg Med Chem Lett 29: 1074-1078 (2019)
Article DOI: 10.1016/j.bmcl.2019.03.001
3D
3D Structure (crystal)
Tyrosine-protein kinase BTK
(Homo sapiens (Human))
BDBM205094
(US9556147, 3)
Show SMILES Cn1c2C[C@@H](O)Cc3c(cccc3-n3ncc4cc(cc(F)c4c3=O)C(C)(C)C)-c2cc(Nc2ccc(cn2)C(=O)N2CCOCC2)c1=O |r|
Show InChI InChI=1S/C37H37FN6O5/c1-37(2,3)23-14-22-20-40-44(36(48)33(22)28(38)15-23)30-7-5-6-25-26(30)16-24(45)17-31-27(25)18-29(35(47)42(31)4)41-32-9-8-21(19-39-32)34(46)43-10-12-49-13-11-43/h5-9,14-15,18-20,24,45H,10-13,16-17H2,1-4H3,(H,39,41)/t24-/m0/s1
NCI pathway
Reactome pathway
n/an/a 26n/an/an/an/an/an/a
Hoffmann-La Roche Ltd.
Curated by ChEMBL
Assay Description
Inhibition of BTK in goat F(ab')2 anti-human IgM-stimulated human whole blood assessed as suppression of CD69 expression on B cells pretreated for 30...
Bioorg Med Chem Lett 29: 1074-1078 (2019)
Article DOI: 10.1016/j.bmcl.2019.03.001
3D
3D Structure (crystal)