BDBM2051 2,8-disubstituted dipyridodiazepinone 34::2-Chloro-5,11-dihydro-11-ethyl-5-methyl-8-((1-oxo-4-pyridinyl)-oxy)methyl-6H-dipyrido[3,2-b:2 ,3 -e][1,4]diazepin-6-one::4-({5-chloro-2-ethyl-9-methyl-10-oxo-2,4,9,15-tetraazatricyclo[9.4.0.0^{3,8}]pentadeca-1(11),3,5,7,12,14-hexaen-13-yl}methoxy)-1-oxidopyridin-1-ium
SMILES: CCN1c2nc(Cl)ccc2N(C)C(=O)c2cc(COc3cc[n+]([O-])cc3)cnc12
InChI Key: InChIKey=GCJKAPWJHBJEPX-UHFFFAOYSA-N
Data: 2 IC50
Activity Spreadsheet -- Enzyme Inhibition Constant Data from BindingDB
Found 2 hits for monomerid = 2051
Trg + Lig
Ki
nM
ΔG°
kcal/mole
IC50
nM
Kd
nM
EC50/IC50
nM
koff
s-1
kon
M-1s-1
pHTemp
°C
Human immunodeficiency virus type 1 reverse transcriptase
(Human immunodeficiency virus 1)
BDBM2051
(2,8-disubstituted dipyridodiazepinone 34 | 2-Chlor...)
Show SMILES CCN1c2nc(Cl)ccc2N(C)C(=O)c2cc(COc3cc[n+]([O-])cc3)cnc12
Show InChI InChI=1S/C20H18ClN5O3/c1-3-26-18-15(20(27)24(2)16-4-5-17(21)23-19(16)26)10-13(11-22-18)12-29-14-6-8-25(28)9-7-14/h4-11H,3,12H2,1-2H3
n/an/a 230n/an/an/an/an/an/a
Boehringer Ingelheim Pharmaceuticals Inc.
Assay Description
Inhibitory activity against HIV-1 wild-type reverse transcriptase.
J Med Chem 41: 2972-84 (1998)
Article DOI: 10.1021/jm9707030
BindingDB Entry DOI: 10.7270/Q2J964K7
HIV-1 Reverse Transcriptase
(Human immunodeficiency virus type 1)
BDBM2051
(2,8-disubstituted dipyridodiazepinone 34 | 2-Chlor...)
Show SMILES CCN1c2nc(Cl)ccc2N(C)C(=O)c2cc(COc3cc[n+]([O-])cc3)cnc12
Show InChI InChI=1S/C20H18ClN5O3/c1-3-26-18-15(20(27)24(2)16-4-5-17(21)23-19(16)26)10-13(11-22-18)12-29-14-6-8-25(28)9-7-14/h4-11H,3,12H2,1-2H3
n/an/a 230n/an/an/an/an/an/a
Boehringer Ingelheim Pharmaceuticals Inc.
Assay Description
The IC50 of reverse transcriptase is the concentration that inhibits 50% of recombinant HIV-1 RT RNA-directed DNA polymerase activity in vitro.
J Med Chem 41: 2972-84 (1998)
Article DOI: 10.1021/jm9707030
BindingDB Entry DOI: 10.7270/Q2J964K7