BDBM205124 3-methyl-2-{[(3r,6r)-6- methyl-1-{[2-(1,3-thiazol-4- yl)phenyl]carbonyl}piperidin- 3-yl]oxy}pyridine-4- carbonitrile::US9546152, example 33
SMILES: C[C@@H]1CC[C@H](CN1C(=O)c1ccccc1-c1cscn1)Oc1nccc(C#N)c1C
InChI Key: InChIKey=PHPUKRNBBIXYQK-CRAIPNDOSA-N
Data: 2 KI  2 IC50
Activity Spreadsheet -- Enzyme Inhibition Constant Data from BindingDB
Found 4 hits for monomerid = 205124
Trg + Lig
Ki
nM
ΔG°
kcal/mole
IC50
nM
Kd
nM
EC50/IC50
nM
koff
s-1
kon
M-1s-1
pHTemp
°C
Orexin receptor type 2
(Homo sapiens (Human))
BDBM205124
(3-methyl-2-{[(3r,6r)-6- methyl-1-{[2-(1,3-thiazol-...)
Show SMILES C[C@@H]1CC[C@H](CN1C(=O)c1ccccc1-c1cscn1)Oc1nccc(C#N)c1C |r|
Show InChI InChI=1S/C23H22N4O2S/c1-15-7-8-18(29-22-16(2)17(11-24)9-10-25-22)12-27(15)23(28)20-6-4-3-5-19(20)21-13-30-14-26-21/h3-6,9-10,13-15,18H,7-8,12H2,1-2H3/t15-,18-/m1/s1
Reactome pathway
US Patent
0.200n/an/an/an/an/an/an/an/a
MERCK SHARP & DOHME CORP.
US Patent
Assay Description
Radioligand binding assay (described in Bergman et. al. Bioorg. Med. Chem. Lett. 2008, 18, 1425-1430) in which the inhibition constant (Ki) is determ...
US Patent US9546152 (2017)
BindingDB Entry DOI: 10.7270/Q2D50PZW
Orexin receptor type 1
(Homo sapiens (Human))
BDBM205124
(3-methyl-2-{[(3r,6r)-6- methyl-1-{[2-(1,3-thiazol-...)
Show SMILES C[C@@H]1CC[C@H](CN1C(=O)c1ccccc1-c1cscn1)Oc1nccc(C#N)c1C |r|
Show InChI InChI=1S/C23H22N4O2S/c1-15-7-8-18(29-22-16(2)17(11-24)9-10-25-22)12-27(15)23(28)20-6-4-3-5-19(20)21-13-30-14-26-21/h3-6,9-10,13-15,18H,7-8,12H2,1-2H3/t15-,18-/m1/s1
Reactome pathway
US Patent
150n/an/an/an/an/an/an/an/a
MERCK SHARP & DOHME CORP.
US Patent
Assay Description
Radioligand binding assay (described in Bergman et. al. Bioorg. Med. Chem. Lett. 2008, 18, 1425-1430) in which the inhibition constant (Ki) is determ...
US Patent US9546152 (2017)
BindingDB Entry DOI: 10.7270/Q2D50PZW
Orexin receptor type 2
(Homo sapiens (Human))
BDBM205124
(3-methyl-2-{[(3r,6r)-6- methyl-1-{[2-(1,3-thiazol-...)
Show SMILES C[C@@H]1CC[C@H](CN1C(=O)c1ccccc1-c1cscn1)Oc1nccc(C#N)c1C |r|
Show InChI InChI=1S/C23H22N4O2S/c1-15-7-8-18(29-22-16(2)17(11-24)9-10-25-22)12-27(15)23(28)20-6-4-3-5-19(20)21-13-30-14-26-21/h3-6,9-10,13-15,18H,7-8,12H2,1-2H3/t15-,18-/m1/s1
Reactome pathway
US Patent
n/an/a 6n/an/an/an/an/an/a
MERCK SHARP & DOHME CORP.
US Patent
Assay Description
The utility of the compounds in accordance with the present invention as orexin receptor OX1R and/or OX2R antagonists may be readily determined witho...
US Patent US9546152 (2017)
BindingDB Entry DOI: 10.7270/Q2D50PZW
Orexin receptor type 1
(Homo sapiens (Human))
BDBM205124
(3-methyl-2-{[(3r,6r)-6- methyl-1-{[2-(1,3-thiazol-...)
Show SMILES C[C@@H]1CC[C@H](CN1C(=O)c1ccccc1-c1cscn1)Oc1nccc(C#N)c1C |r|
Show InChI InChI=1S/C23H22N4O2S/c1-15-7-8-18(29-22-16(2)17(11-24)9-10-25-22)12-27(15)23(28)20-6-4-3-5-19(20)21-13-30-14-26-21/h3-6,9-10,13-15,18H,7-8,12H2,1-2H3/t15-,18-/m1/s1
Reactome pathway
US Patent
n/an/a 514n/an/an/an/an/an/a
MERCK SHARP & DOHME CORP.
US Patent
Assay Description
The utility of the compounds in accordance with the present invention as orexin receptor OX1R and/or OX2R antagonists may be readily determined witho...
US Patent US9546152 (2017)
BindingDB Entry DOI: 10.7270/Q2D50PZW