BDBM205245 3-ethyl-2-{[(3r,6r)-6- methyl-1-{[2-(2h-1,2,3- triazol-2- yl)phenyl]carbonyl}piperidin- 3-yl]oxy}pyridine-4- carbonitrile::US9546152, example 93
SMILES: CCc1c(O[C@@H]2CC[C@@H](C)N(C2)C(=O)c2ccccc2-n2nccn2)nccc1C#N
InChI Key: InChIKey=ZRRPTFZCRHHEAA-SJLPKXTDSA-N
Data: 2 KI  2 IC50
Activity Spreadsheet -- Enzyme Inhibition Constant Data from BindingDB
Found 4 hits for monomerid = 205245
Trg + Lig
Ki
nM
ΔG°
kcal/mole
IC50
nM
Kd
nM
EC50/IC50
nM
koff
s-1
kon
M-1s-1
pHTemp
°C
Orexin receptor type 2
(Homo sapiens (Human))
BDBM205245
(3-ethyl-2-{[(3r,6r)-6- methyl-1-{[2-(2h-1,2,3- tri...)
Show SMILES CCc1c(O[C@@H]2CC[C@@H](C)N(C2)C(=O)c2ccccc2-n2nccn2)nccc1C#N |r|
Show InChI InChI=1S/C23H24N6O2/c1-3-19-17(14-24)10-11-25-22(19)31-18-9-8-16(2)28(15-18)23(30)20-6-4-5-7-21(20)29-26-12-13-27-29/h4-7,10-13,16,18H,3,8-9,15H2,1-2H3/t16-,18-/m1/s1
Reactome pathway
US Patent
0.100n/an/an/an/an/an/an/an/a
MERCK SHARP & DOHME CORP.
US Patent
Assay Description
Radioligand binding assay (described in Bergman et. al. Bioorg. Med. Chem. Lett. 2008, 18, 1425-1430) in which the inhibition constant (Ki) is determ...
US Patent US9546152 (2017)
BindingDB Entry DOI: 10.7270/Q2D50PZW
Orexin receptor type 1
(Homo sapiens (Human))
BDBM205245
(3-ethyl-2-{[(3r,6r)-6- methyl-1-{[2-(2h-1,2,3- tri...)
Show SMILES CCc1c(O[C@@H]2CC[C@@H](C)N(C2)C(=O)c2ccccc2-n2nccn2)nccc1C#N |r|
Show InChI InChI=1S/C23H24N6O2/c1-3-19-17(14-24)10-11-25-22(19)31-18-9-8-16(2)28(15-18)23(30)20-6-4-5-7-21(20)29-26-12-13-27-29/h4-7,10-13,16,18H,3,8-9,15H2,1-2H3/t16-,18-/m1/s1
Reactome pathway
US Patent
58n/an/an/an/an/an/an/an/a
MERCK SHARP & DOHME CORP.
US Patent
Assay Description
Radioligand binding assay (described in Bergman et. al. Bioorg. Med. Chem. Lett. 2008, 18, 1425-1430) in which the inhibition constant (Ki) is determ...
US Patent US9546152 (2017)
BindingDB Entry DOI: 10.7270/Q2D50PZW
Orexin receptor type 2
(Homo sapiens (Human))
BDBM205245
(3-ethyl-2-{[(3r,6r)-6- methyl-1-{[2-(2h-1,2,3- tri...)
Show SMILES CCc1c(O[C@@H]2CC[C@@H](C)N(C2)C(=O)c2ccccc2-n2nccn2)nccc1C#N |r|
Show InChI InChI=1S/C23H24N6O2/c1-3-19-17(14-24)10-11-25-22(19)31-18-9-8-16(2)28(15-18)23(30)20-6-4-5-7-21(20)29-26-12-13-27-29/h4-7,10-13,16,18H,3,8-9,15H2,1-2H3/t16-,18-/m1/s1
Reactome pathway
US Patent
n/an/a 8n/an/an/an/an/an/a
MERCK SHARP & DOHME CORP.
US Patent
Assay Description
The utility of the compounds in accordance with the present invention as orexin receptor OX1R and/or OX2R antagonists may be readily determined witho...
US Patent US9546152 (2017)
BindingDB Entry DOI: 10.7270/Q2D50PZW
Orexin receptor type 1
(Homo sapiens (Human))
BDBM205245
(3-ethyl-2-{[(3r,6r)-6- methyl-1-{[2-(2h-1,2,3- tri...)
Show SMILES CCc1c(O[C@@H]2CC[C@@H](C)N(C2)C(=O)c2ccccc2-n2nccn2)nccc1C#N |r|
Show InChI InChI=1S/C23H24N6O2/c1-3-19-17(14-24)10-11-25-22(19)31-18-9-8-16(2)28(15-18)23(30)20-6-4-5-7-21(20)29-26-12-13-27-29/h4-7,10-13,16,18H,3,8-9,15H2,1-2H3/t16-,18-/m1/s1
Reactome pathway
US Patent
n/an/a 178n/an/an/an/an/an/a
MERCK SHARP & DOHME CORP.
US Patent
Assay Description
The utility of the compounds in accordance with the present invention as orexin receptor OX1R and/or OX2R antagonists may be readily determined witho...
US Patent US9546152 (2017)
BindingDB Entry DOI: 10.7270/Q2D50PZW