BDBM2053 2,8-disubstituted dipyridodiazepinone 36::2-Chloro-5,11-dihydro-11-ethyl-5-methyl-8-((2-trifluoromethyl-1-oxo-pyridin-4-yl)oxy)methyl-6H-dipyrido[3,2-b:2 ,3 -e][1,4]diazepin-6-one::4-({5-chloro-2-ethyl-9-methyl-10-oxo-2,4,9,15-tetraazatricyclo[9.4.0.0^{3,8}]pentadeca-1(11),3,5,7,12,14-hexaen-13-yl}methoxy)-1-oxido-2-(trifluoromethyl)pyridin-1-ium
SMILES: CCN1c2nc(Cl)ccc2N(C)C(=O)c2cc(COc3cc[n+]([O-])c(c3)C(F)(F)F)cnc12
InChI Key: InChIKey=KAZIWSBVZDUBAI-UHFFFAOYSA-N
Data: 3 IC50
Activity Spreadsheet -- Enzyme Inhibition Constant Data from BindingDB
Found 3 hits for monomerid = 2053
Trg + Lig
Ki
nM
ΔG°
kcal/mole
IC50
nM
Kd
nM
EC50/IC50
nM
koff
s-1
kon
M-1s-1
pHTemp
°C
HIV-1 Reverse Transcriptase
(Human immunodeficiency virus type 1)
BDBM2053
(2,8-disubstituted dipyridodiazepinone 36 | 2-Chlor...)
Show SMILES CCN1c2nc(Cl)ccc2N(C)C(=O)c2cc(COc3cc[n+]([O-])c(c3)C(F)(F)F)cnc12
Show InChI InChI=1S/C21H17ClF3N5O3/c1-3-29-18-14(20(31)28(2)15-4-5-17(22)27-19(15)29)8-12(10-26-18)11-33-13-6-7-30(32)16(9-13)21(23,24)25/h4-10H,3,11H2,1-2H3
n/an/a 120n/an/an/an/an/an/a
Boehringer Ingelheim Pharmaceuticals Inc.
Assay Description
The IC50 of reverse transcriptase is the concentration that inhibits 50% of recombinant HIV-1 RT RNA-directed DNA polymerase activity in vitro.
J Med Chem 41: 2972-84 (1998)
Article DOI: 10.1021/jm9707030
BindingDB Entry DOI: 10.7270/Q2J964K7
Human immunodeficiency virus type 1 reverse transcriptase
(Human immunodeficiency virus 1)
BDBM2053
(2,8-disubstituted dipyridodiazepinone 36 | 2-Chlor...)
Show SMILES CCN1c2nc(Cl)ccc2N(C)C(=O)c2cc(COc3cc[n+]([O-])c(c3)C(F)(F)F)cnc12
Show InChI InChI=1S/C21H17ClF3N5O3/c1-3-29-18-14(20(31)28(2)15-4-5-17(22)27-19(15)29)8-12(10-26-18)11-33-13-6-7-30(32)16(9-13)21(23,24)25/h4-10H,3,11H2,1-2H3
n/an/a 270n/an/an/an/an/an/a
Boehringer Ingelheim Pharmaceuticals Inc.
Assay Description
Inhibitory activity against HIV-1 Y181C reverse transcriptase.
J Med Chem 41: 2972-84 (1998)
Article DOI: 10.1021/jm9707030
BindingDB Entry DOI: 10.7270/Q2J964K7
HIV-1 Reverse Transcriptase Mutant (Y181C)
(Human immunodeficiency virus type 1)
BDBM2053
(2,8-disubstituted dipyridodiazepinone 36 | 2-Chlor...)
Show SMILES CCN1c2nc(Cl)ccc2N(C)C(=O)c2cc(COc3cc[n+]([O-])c(c3)C(F)(F)F)cnc12
Show InChI InChI=1S/C21H17ClF3N5O3/c1-3-29-18-14(20(31)28(2)15-4-5-17(22)27-19(15)29)8-12(10-26-18)11-33-13-6-7-30(32)16(9-13)21(23,24)25/h4-10H,3,11H2,1-2H3
n/an/a 270n/an/an/an/an/an/a
Boehringer Ingelheim Pharmaceuticals Inc.
Assay Description
The IC50 of reverse transcriptase is the concentration that inhibits 50% of recombinant HIV-1 RT RNA-directed DNA polymerase activity in vitro.
J Med Chem 41: 2972-84 (1998)
Article DOI: 10.1021/jm9707030
BindingDB Entry DOI: 10.7270/Q2J964K7