BDBM205314 US9249125, 67
SMILES: CC(C)(C)c1cc(NC(=O)Nc2ccc(Oc3ccnc(Nc4ccc5[nH]ncc5c4)c3)c3ccccc23)n(n1)-c1ccc(OCCN2CCOCC2)cc1
InChI Key: InChIKey=OWGQZIFBXSVHQW-UHFFFAOYSA-N
Data: 4 IC50
Activity Spreadsheet -- Enzyme Inhibition Constant Data from BindingDB
Found 4 hits for monomerid = 205314
Trg + Lig
Ki
nM
ΔG°
kcal/mole
IC50
nM
Kd
nM
EC50/IC50
nM
koff
s-1
kon
M-1s-1
pHTemp
°C
Mitogen-activated protein kinase 14
(Homo sapiens (Human))
BDBM205314
(US9249125, 67)
Show SMILES CC(C)(C)c1cc(NC(=O)Nc2ccc(Oc3ccnc(Nc4ccc5[nH]ncc5c4)c3)c3ccccc23)n(n1)-c1ccc(OCCN2CCOCC2)cc1
Show InChI InChI=1S/C42H43N9O4/c1-42(2,3)38-26-40(51(49-38)30-9-11-31(12-10-30)54-23-20-50-18-21-53-22-19-50)47-41(52)46-36-14-15-37(34-7-5-4-6-33(34)36)55-32-16-17-43-39(25-32)45-29-8-13-35-28(24-29)27-44-48-35/h4-17,24-27H,18-23H2,1-3H3,(H,43,45)(H,44,48)(H2,46,47,52)
NCI pathway
Reactome pathway
US Patent
n/an/a 5n/an/an/an/an/an/a
RESPIVERT LIMITED; TOPIVERT PHARMA LIMITED
US Patent
Assay Description
The inhibitory activities of test compounds against the p38 MAPKα isoform (MAPK14: Invitrogen), are evaluated indirectly by determining the l...
US Patent US9249125 (2016)
BindingDB Entry DOI: 10.7270/Q2CN72QG
Glycogen synthase kinase-3
(Homo sapiens (Human))
BDBM205314
(US9249125, 67)
Show SMILES CC(C)(C)c1cc(NC(=O)Nc2ccc(Oc3ccnc(Nc4ccc5[nH]ncc5c4)c3)c3ccccc23)n(n1)-c1ccc(OCCN2CCOCC2)cc1
Show InChI InChI=1S/C42H43N9O4/c1-42(2,3)38-26-40(51(49-38)30-9-11-31(12-10-30)54-23-20-50-18-21-53-22-19-50)47-41(52)46-36-14-15-37(34-7-5-4-6-33(34)36)55-32-16-17-43-39(25-32)45-29-8-13-35-28(24-29)27-44-48-35/h4-17,24-27H,18-23H2,1-3H3,(H,43,45)(H,44,48)(H2,46,47,52)
NCI pathway
Reactome pathway
US Patent
n/an/a 3.04E+3n/an/an/an/an/an/a
RESPIVERT LIMITED; TOPIVERT PHARMA LIMITED
US Patent
Assay Description
The inhibitory activities of compounds of the invention against the GSK 3α enzyme isoform (Invitrogen), are evaluated by determining the level ...
US Patent US9249125 (2016)
BindingDB Entry DOI: 10.7270/Q2CN72QG
Tyrosine-protein kinase SYK
(Homo sapiens (Human))
BDBM205314
(US9249125, 67)
Show SMILES CC(C)(C)c1cc(NC(=O)Nc2ccc(Oc3ccnc(Nc4ccc5[nH]ncc5c4)c3)c3ccccc23)n(n1)-c1ccc(OCCN2CCOCC2)cc1
Show InChI InChI=1S/C42H43N9O4/c1-42(2,3)38-26-40(51(49-38)30-9-11-31(12-10-30)54-23-20-50-18-21-53-22-19-50)47-41(52)46-36-14-15-37(34-7-5-4-6-33(34)36)55-32-16-17-43-39(25-32)45-29-8-13-35-28(24-29)27-44-48-35/h4-17,24-27H,18-23H2,1-3H3,(H,43,45)(H,44,48)(H2,46,47,52)
NCI pathway
Reactome pathway
US Patent
n/an/a<1n/an/an/an/an/an/a
RESPIVERT LIMITED; TOPIVERT PHARMA LIMITED
US Patent
Assay Description
The inhibitory activities of compounds of the invention against c-Src and Syk enzymes (Invitrogen), are evaluated in a similar fashion to that descri...
US Patent US9249125 (2016)
BindingDB Entry DOI: 10.7270/Q2CN72QG
Proto-oncogene tyrosine-protein kinase Src
(Homo sapiens (Human))
BDBM205314
(US9249125, 67)
Show SMILES CC(C)(C)c1cc(NC(=O)Nc2ccc(Oc3ccnc(Nc4ccc5[nH]ncc5c4)c3)c3ccccc23)n(n1)-c1ccc(OCCN2CCOCC2)cc1
Show InChI InChI=1S/C42H43N9O4/c1-42(2,3)38-26-40(51(49-38)30-9-11-31(12-10-30)54-23-20-50-18-21-53-22-19-50)47-41(52)46-36-14-15-37(34-7-5-4-6-33(34)36)55-32-16-17-43-39(25-32)45-29-8-13-35-28(24-29)27-44-48-35/h4-17,24-27H,18-23H2,1-3H3,(H,43,45)(H,44,48)(H2,46,47,52)
US Patent
n/an/a<1n/an/an/an/an/an/a
RESPIVERT LIMITED; TOPIVERT PHARMA LIMITED
US Patent
Assay Description
The inhibitory activities of compounds of the invention against c-Src and Syk enzymes (Invitrogen), are evaluated in a similar fashion to that descri...
US Patent US9249125 (2016)
BindingDB Entry DOI: 10.7270/Q2CN72QG