null
SMILES: CCCCCCN(CCCCCC)c1nc(nc(n1)-c1cccn1-c1ccccc1)N1CCCCCC1
InChI Key: InChIKey=LELNOJCIEJSNGV-UHFFFAOYSA-N
Activity Spreadsheet -- Enzyme Inhibition Constant Data from BindingDB
Found 4 hits for monomerid = 205470
Trg + Lig
Ki
nM
ΔG°
kcal/mole
IC50
nM
Kd
nM
EC50/IC50
nM
koff
s-1
kon
M-1s-1
pHTemp
°C
Inorganic pyrophosphatase
(Mycobacterium tuberculosis)
BDBM205470
(PPiase inhibitor, 14)
Show SMILES CCCCCCN(CCCCCC)c1nc(nc(n1)-c1cccn1-c1ccccc1)N1CCCCCC1
Show InChI InChI=1S/C31H46N6/c1-3-5-7-14-22-35(23-15-8-6-4-2)30-32-29(33-31(34-30)36-24-16-9-10-17-25-36)28-21-18-26-37(28)27-19-12-11-13-20-27/h11-13,18-21,26H,3-10,14-17,22-25H2,1-2H3
n/an/a 4.40E+4n/an/an/an/a7.525
University of Kentucky
Assay Description
The compounds were first mixed with tetrasodium PPi (final concentration of 100 μM) at concentrations specified in the text in the reaction buff...
ACS Chem Biol 11: 3084-3092 (2016)
Article DOI: 10.1021/acschembio.6b00510
BindingDB Entry DOI: 10.7270/Q2GF0SBF
Probable manganese-dependent inorganic pyrophosphatase
(Staphylococcus aureus (Firmicutes))
BDBM205470
(PPiase inhibitor, 14)
Show SMILES CCCCCCN(CCCCCC)c1nc(nc(n1)-c1cccn1-c1ccccc1)N1CCCCCC1
Show InChI InChI=1S/C31H46N6/c1-3-5-7-14-22-35(23-15-8-6-4-2)30-32-29(33-31(34-30)36-24-16-9-10-17-25-36)28-21-18-26-37(28)27-19-12-11-13-20-27/h11-13,18-21,26H,3-10,14-17,22-25H2,1-2H3
n/an/a 2.69E+5n/an/an/an/a7.525
University of Kentucky
Assay Description
The compounds were first mixed with tetrasodium PPi (final concentration of 100 μM) at concentrations specified in the text in the reaction buff...
ACS Chem Biol 11: 3084-3092 (2016)
Article DOI: 10.1021/acschembio.6b00510
BindingDB Entry DOI: 10.7270/Q2GF0SBF
Inorganic pyrophosphatase
(Saccharomyces cerevisiae (Yeast))
BDBM205470
(PPiase inhibitor, 14)
Show SMILES CCCCCCN(CCCCCC)c1nc(nc(n1)-c1cccn1-c1ccccc1)N1CCCCCC1
Show InChI InChI=1S/C31H46N6/c1-3-5-7-14-22-35(23-15-8-6-4-2)30-32-29(33-31(34-30)36-24-16-9-10-17-25-36)28-21-18-26-37(28)27-19-12-11-13-20-27/h11-13,18-21,26H,3-10,14-17,22-25H2,1-2H3
n/an/a 3.78E+5n/an/an/an/a7.525
University of Kentucky
Assay Description
The compounds were first mixed with tetrasodium PPi (final concentration of 100 μM) at concentrations specified in the text in the reaction buff...
ACS Chem Biol 11: 3084-3092 (2016)
Article DOI: 10.1021/acschembio.6b00510
BindingDB Entry DOI: 10.7270/Q2GF0SBF
Inorganic pyrophosphatase
(Escherichia coli (Enterobacteria))
BDBM205470
(PPiase inhibitor, 14)
Show SMILES CCCCCCN(CCCCCC)c1nc(nc(n1)-c1cccn1-c1ccccc1)N1CCCCCC1
Show InChI InChI=1S/C31H46N6/c1-3-5-7-14-22-35(23-15-8-6-4-2)30-32-29(33-31(34-30)36-24-16-9-10-17-25-36)28-21-18-26-37(28)27-19-12-11-13-20-27/h11-13,18-21,26H,3-10,14-17,22-25H2,1-2H3
n/an/a 2.69E+5n/an/an/an/a7.525
University of Kentucky
Assay Description
The compounds were first mixed with tetrasodium PPi (final concentration of 100 μM) at concentrations specified in the text in the reaction buff...
ACS Chem Biol 11: 3084-3092 (2016)
Article DOI: 10.1021/acschembio.6b00510
BindingDB Entry DOI: 10.7270/Q2GF0SBF