BDBM205718 US9255090, 187
SMILES: COc1cc(CC(O)=O)ccc1-c1ccc(F)c2CCN(Cc12)C(=O)CCCc1ccccc1
InChI Key: InChIKey=KKHPRGAQNHFATK-UHFFFAOYSA-N
Data: 1 IC50
Activity Spreadsheet -- Enzyme Inhibition Constant Data from BindingDB
Found 1 hit for monomerid = 205718
Trg + Lig
Ki
nM
ΔG°
kcal/mole
IC50
nM
Kd
nM
EC50/IC50
nM
koff
s-1
kon
M-1s-1
pHTemp
°C
G protein-coupled receptor 44
(Homo sapiens (Human))
BDBM205718
(US9255090, 187)
Show SMILES COc1cc(CC(O)=O)ccc1-c1ccc(F)c2CCN(Cc12)C(=O)CCCc1ccccc1
Show InChI InChI=1S/C28H28FNO4/c1-34-26-16-20(17-28(32)33)10-11-23(26)21-12-13-25(29)22-14-15-30(18-24(21)22)27(31)9-5-8-19-6-3-2-4-7-19/h2-4,6-7,10-13,16H,5,8-9,14-15,17-18H2,1H3,(H,32,33)
Reactome pathway
US Patent
n/an/a 0.890n/an/an/an/a7.025
ACTELION PHARMACEUTICALS LTD.
US Patent
Assay Description
Binding assay was performed in a final assay volume of 250 ul. First, 25 ul of test compound, previously diluted in Binding-Buffer (Binding-Buffer: 5...
US Patent US9255090 (2016)
BindingDB Entry DOI: 10.7270/Q2TQ60B2